Renew Service
type: Concept
definition: Agent provides service to extend (renew) the validity of a credential.
term status: stable
change history: https://credreg.net/ctdl/termhistory/serviceType/RenewService/json
in scheme: AgentServiceType
top concept of: AgentServiceType