Publication Status Concept Scheme
type: ConceptScheme
comment: Describes the various publication statuses of competency frameworks and statements.
term status: stable
change history: https://credreg.net/ctdlasn/termhistory/ceasn/PublicationStatus/json
equivalent class: ASNPublicationStatus
has concept: Deprecated
has concept: Draft
has concept: Published
has top concept: Deprecated
has top concept: Draft
has top concept: Published

Deprecated
type: Concept
definition: Status assigned to a document/statement by the promulgating agency asserting that the document/statement has been superseded or its use otherwise disfavored.
term status: stable
change history: https://credreg.net/ctdlasn/termhistory/publicationStatus/Deprecated/json
equivalent class: Deprecated
in scheme: Publication Status Concept Scheme
top concept of: Publication Status Concept Scheme

Draft
type: Concept
definition: A status assigned to all documents/statements during development.
usage note: Draft documents and statements should not be displayed to anyone other than their owners and relevant administrators.
term status: stable
change history: https://credreg.net/ctdlasn/termhistory/publicationStatus/Draft/json
equivalent class: Draft
in scheme: Publication Status Concept Scheme
top concept of: Publication Status Concept Scheme

Published
type: Concept
definition: Status assigned to all documents that have been published.
term status: stable
change history: https://credreg.net/ctdlasn/termhistory/publicationStatus/Published/json
equivalent class: Published
in scheme: Publication Status Concept Scheme
top concept of: Publication Status Concept Scheme