Author
type: Property
comment: A person or organization chiefly responsible for the intellectual or artistic content of this competency framework or competency.
term status: stable
change history: https://credreg.net/ctdlasn/termhistory/ceasn/author/json
sub property of: contributor
domain includes: Competency
domain includes: CompetencyFramework
range includes: string
equivalent property: aut