Broad Alignment
type: Property
comment: The referenced competency covers all of the relevant concepts in this competency as well as relevant concepts not found in this competency.
term status: stable
change history: https://credreg.net/ctdlasn/termhistory/ceasn/broadAlignment/json
domain includes: Competency
range includes: Competency
equivalent property: broadAlignment