Broad Match
type: Property
comment: Assertion indicates that the referenced concept is broader in some way than this concept.
term status: stable
change history: https://credreg.net/ctdlasn/termhistory/skos/broadMatch/json
domain includes: Concept
range includes: Concept