Coded Notation
type: Property
comment: An alphanumeric notation or ID code as defined by the promulgating body to identify this resource.
description: This property should be used only for codes created by the promulgating body. For alternative competency notations in common use in the community of practice, but not endorsed by the promulgating body, the altCodedNotation property can be used (sparingly on clear evidence of common use and need).
term status: stable
change history: https://credreg.net/ctdlasn/termhistory/ceasn/codedNotation/json
sub property of: identifier
domain includes: Competency
range includes: string
equivalent property: statementNotation
equivalent property: humanCodingScheme
equivalent property: codedNotation