Comment
type: Property
comment: Supplemental text provided by the promulgating body that clarifies the nature, scope or use of this resource.
description: Use this property when the text provides useful context for this resource.
term status: stable
change history: https://credreg.net/ctdlasn/termhistory/ceasn/comment/json
domain includes: Competency
domain includes: Job
domain includes: Occupation
domain includes: Task
domain includes: WorkRole
range includes: langString
equivalent property: comment
equivalent property: notes