Competency Category
type: Property
comment: The textual label identifying the category of the competency as designated by the promulgating body.
description: This property points to a class, not to instances of that class. For example, where two competencies in a competency framework have been identified respectively by the promulgating agency as "Strand: Rennaisance" and "Strand: Social history", the statementLabel for both these competencies is "Strand".
term status: stable
change history: https://credreg.net/ctdlasn/termhistory/ceasn/competencyCategory/json
domain includes: Competency
range includes: langString
equivalent property: statementLabel
equivalent property: CFItemType