Competency Text
type: Property
comment: The text of the competency.
usage note: This property should be used to provide the actual text of the competency statement. To provide information about the competency other than the text itself, use the comment property.
term status: stable
change history: https://credreg.net/ctdlasn/termhistory/ceasn/competencyText/json
sub property of: description
domain includes: Competency
range includes: langString
equivalent property: fullStatement