Complexity Level
type: Property
comment: The expected performance level of a learner or professional as defined by a competency.
term status: stable
change history: https://credreg.net/ctdlasn/termhistory/ceasn/complexityLevel/json
domain includes: Competency
range includes: ProficiencyScale
equivalent property: complexityLevel