Creator
type: Property
comment: An entity primarily responsible for making this competency framework or competency.
description: The creator property is used with non-canonical statements created by a third party.
term status: stable
change history: https://credreg.net/ctdlasn/termhistory/ceasn/creator/json
sub property of: contributor
domain includes: Competency
domain includes: CompetencyFramework
range includes: CredentialOrganization
range includes: QACredentialOrganization
equivalent property: creator