Date Copyrighted
type: Property
comment: Date of a statement of copyright for this resource, such as ©2017.
term status: stable
change history: https://credreg.net/ctdlasn/termhistory/ceasn/dateCopyrighted/json
sub property of: date
domain includes: CompetencyFramework
domain includes: ConceptScheme
range includes: string
equivalent property: dateCopyrighted