Date Created
type: Property
comment: Date of creation of this resource.
description: The dateCreated property is used for non-canonical statements created by a third party.
term status: stable
change history: https://credreg.net/ctdlasn/termhistory/ceasn/dateCreated/json
sub property of: date
domain includes: Competency
domain includes: CompetencyFramework
domain includes: ConceptScheme
range includes: date
equivalent property: created