Date Modified
type: Property
comment: The date on which this framework or competency was most recently modified in some way.
term status: stable
change history: https://credreg.net/ctdlasn/termhistory/ceasn/dateModified/json
sub property of: date
domain includes: Competency
domain includes: CompetencyFramework
range includes: dateTime
equivalent property: modified
equivalent property: dateModified