Date Valid Until
type: Property
comment: End date of validity of this competency framework.
usage note: Where the standard document is valid for a given period of time, use both the dateValidFrom and dateValidUntil properties.
term status: stable
change history: https://credreg.net/ctdlasn/termhistory/ceasn/dateValidUntil/json
sub property of: valid
domain includes: CompetencyFramework
range includes: dateTime
equivalent property: endDate