Derived From
type: Property
comment: A version of the entity being referenced that has been modified in meaning through editing, extension or refinement.
term status: stable
change history: https://credreg.net/ctdlasn/termhistory/ceasn/derivedFrom/json
sub property of: relation
domain includes: Competency
domain includes: CompetencyFramework
domain includes: TransferValueProfile
range includes: Competency
range includes: CompetencyFramework
range includes: TransferValueProfile
equivalent property: derivedFrom