Exact Alignment
type: Property
comment: The relevant concepts in this competency and the referenced competency are coextensive.
term status: stable
change history: https://credreg.net/ctdlasn/termhistory/ceasn/exactAlignment/json
domain includes: Competency
range includes: Competency
equivalent property: exactAlignment