Exact Match
type: Property
comment: Indicates semantic similarity denoting an even higher degree of closeness than skos:closeMatch.
term status: stable
change history: https://credreg.net/ctdlasn/termhistory/skos/exactMatch/json
domain includes: Concept
range includes: Concept