Hidden Label
type: Property
comment: Label not intended for public presentation but to assist applications in disambiguating searcher intent - e.g., hidden labels can be used for common misspelling or a colloquial expression.
term status: stable
change history: https://credreg.net/ctdlasn/termhistory/skos/hiddenLabel/json
domain includes: Concept
range includes: langString