Identifier
type: Property
comment: An alternative URI by which this competency framework or competency is identified.
term status: stable
change history: https://credreg.net/ctdlasn/termhistory/ceasn/identifier/json
domain includes: Competency
domain includes: CompetencyFramework
range includes: anyURI
equivalent property: identifier