In Scheme
type: Property
comment: Concept scheme to which this concept belongs.
term status: stable
change history: https://credreg.net/ctdlasn/termhistory/skos/inScheme/json
domain includes: Concept
range includes: ConceptScheme