Is Part Of
type: Property
comment: Competency framework that this competency is a part of.
usage note: This property does not indicate whether or not this statement is a top-level statement in the referenced competency framework; only that it is in some way a part of that framework. To indicate that this statement is a top-level statement, use both this property and the isChildOf property.
term status: stable
change history: https://credreg.net/ctdlasn/termhistory/ceasn/isPartOf/json
sub property of: relation
domain includes: Competency
range includes: CompetencyFramework
equivalent property: isPartOf