Is Version Of
type: Property
comment: A related competency of which this competency is a version, edition, or adaptation.
description: Changes in version imply substantive changes in content rather than differences in format.
term status: stable
change history: https://credreg.net/ctdlasn/termhistory/ceasn/isVersionOf/json
domain includes: Competency
range includes: Competency
equivalent property: isVersionOf