License
type: Property
comment: A legal document giving official permission to do something with this resource.
description: Value must be the URI to a license document (e.g., Creative Commons license or bespoke license).
term status: stable
change history: https://credreg.net/ctdlasn/termhistory/ceasn/license/json
sub property of: rights
domain includes: CompetencyFramework
domain includes: ConceptScheme
range includes: anyURI
equivalent property: license