List ID
type: Property
comment: An alphanumeric string found in the source framework indicating the relative position of a competency in an ordered list of competencies such as "A", "B", or "a", "b", or "I", "II", or "1", "2".
usage note: Punctuation accompanying alphanumeric strings should not be included.
term status: stable
change history: https://credreg.net/ctdlasn/termhistory/ceasn/listID/json
sub property of: listID
domain includes: Competency
range includes: string