Name
type: Property
comment: The name or title of this competency framework.
term status: stable
change history: https://credreg.net/ctdlasn/termhistory/ceasn/name/json
domain includes: CompetencyFramework
range includes: langString
equivalent property: title
equivalent property: name