Note
type: Property
comment: Annotations to the concept for purposes of general documentation.
term status: stable
change history: https://credreg.net/ctdlasn/termhistory/skos/note/json
domain includes: Concept
range includes: langString