Occupation Type
type: Property
comment: Type of occupation; select from an existing enumeration of such types.
usage note: For U.S. resources, best practice is to identify an occupation using a framework such as the ONet. Other resources may use any framework of the class ceterms:OccupationClassification, such as the EU's ESCO, ISCO-08, and SOC 2010.
term status: stable
change history: https://credreg.net/ctdlasn/termhistory/ceterms/occupationType/json
sub property of: credentialAlignment
domain includes: Competency
domain includes: CompetencyFramework
range includes: CredentialAlignmentObject
target scheme: OccupationClassification
equivalent property: occupationalCategory