Preferred Label
type: Property
comment: Preferred language-tagged label representing this concept.
term status: stable
change history: https://credreg.net/ctdlasn/termhistory/skos/prefLabel/json
domain includes: Concept
range includes: langString