Publication Status Type
type: Property
comment: The publication status of the of this resource.
term status: stable
change history: https://credreg.net/ctdlasn/termhistory/ceasn/publicationStatusType/json
domain includes: CompetencyFramework
domain includes: ConceptScheme
range includes: Concept
target scheme: PublicationStatus
equivalent property: publicationStatus