Publisher Name
type: Property
comment: Name of an agent responsible for making this resource available.
description: Also referred to as the promulgating agency of the entity.
term status: stable
change history: https://credreg.net/ctdlasn/termhistory/ceasn/publisherName/json
domain includes: CompetencyFramework
domain includes: ConceptScheme
range includes: langString
equivalent property: publisher