Rights
type: Property
comment: Information about rights held in and over this competency framework.
term status: stable
change history: https://credreg.net/ctdlasn/termhistory/ceasn/rights/json
sub property of: rights
domain includes: CompetencyFramework
range includes: langString
equivalent property: rights