Should Index
type: Property
comment: Indicates whether correlators should or should not assign the competency during correlation.
term status: unstable
change history: https://credreg.net/ctdlasn/termhistory/ceasn/shouldIndex/json
domain includes: Competency
range includes: boolean
equivalent property: indexingStatus