Source
type: Property
comment: The original competency framework which this resource is based on or derived from.
term status: stable
change history: https://credreg.net/ctdlasn/termhistory/ceasn/source/json
sub property of: relation
domain includes: CompetencyFramework
domain includes: ConceptScheme
range includes: anyURI
equivalent property: source