Deprecated
type: Concept
definition: Status assigned to a document/statement by the promulgating agency asserting that the document/statement has been superseded or its use otherwise disfavored.
term status: stable
change history: https://credreg.net/ctdlasn/termhistory/publicationStatus/Deprecated/json
equivalent class: Deprecated
in scheme: PublicationStatus
top concept of: PublicationStatus