Draft
type: Concept
definition: A status assigned to all documents/statements during development.
usage note: Draft documents and statements should not be displayed to anyone other than their owners and relevant administrators.
term status: stable
change history: https://credreg.net/ctdlasn/termhistory/publicationStatus/Draft/json
equivalent class: Draft
in scheme: PublicationStatus
top concept of: PublicationStatus