Published
type: Concept
definition: Status assigned to all documents that have been published.
term status: stable
change history: https://credreg.net/ctdlasn/termhistory/publicationStatus/Published/json
equivalent class: Published
in scheme: PublicationStatus
top concept of: PublicationStatus