Credential
type: Class
comment: Qualification, achievement, personal or organizational quality, or aspect of an identity typically used to indicate suitability.
description: The ceterms:Credential class is broadly defined to encompass credentials used across domains and communities of practice. The class should be used only when speaking of credentials in general. Subclasses of ceterms:Credential as defined by Credential Engine (or other communities) should be used when referencing specific types of credentials.
term status: stable
change history: https://credreg.net/qdata/termhistory/ceterms/Credential/json
subclass of: CreativeWork
equivalent class: BadgeClass
domain for: Alternate Name
domain for: Description
domain for: Earnings
domain for: Employment Outcome
domain for: Instructional Program Type
domain for: Jurisdiction
domain for: Name
domain for: Relevant Data Set

Earnings Profile
type: Class
comment: Entity that describes earning and related statistical information for a given credential.
usage note: The use of ceterms:AggregateDataProfile instead of this class is strongly recommended.
term status: stable
change history: https://credreg.net/qdata/termhistory/ceterms/EarningsProfile/json
subclass of: AggregateDataProfile
subclass of: CreativeWork
domain for: Alternate Name
domain for: Description
domain for: Jurisdiction
domain for: Name

Employment Outcome Profile
type: Class
comment: Entity that describes employment outcomes and related statistical information for a given credential.
usage note: The use of ceterms:AggregateDataProfile instead of this class is strongly recommended.
term status: stable
change history: https://credreg.net/qdata/termhistory/ceterms/EmploymentOutcomeProfile/json
subclass of: AggregateDataProfile
subclass of: CreativeWork
domain for: Alternate Name
domain for: Description
domain for: Jurisdiction
domain for: Name

Holders Profile
type: Class
comment: Entity describing the count and related statistical information of holders of a given credential.
usage note: The use of ceterms:AggregateDataProfile instead of this class is strongly recommended.
term status: stable
change history: https://credreg.net/qdata/termhistory/ceterms/HoldersProfile/json
subclass of: AggregateDataProfile
subclass of: CreativeWork
domain for: Alternate Name
domain for: Description
domain for: Jurisdiction
domain for: Name

Jurisdiction Profile
type: Class
comment: Geo-political information about applicable geographic areas and their exceptions.
term status: stable
change history: https://credreg.net/qdata/termhistory/ceterms/JurisdictionProfile/json
subclass of: CreativeWork
domain for: Description
domain for: Jurisdiction Exception
domain for: Main Jurisdiction

Place
type: Class
comment: Entity describing a physical location or geospatial area.
term status: stable
change history: https://credreg.net/qdata/termhistory/ceterms/Place/json
equivalent class: Place
domain for: Alternate Name
domain for: Description
domain for: Geographic URI
domain for: Latitude
domain for: Longitude
domain for: Name

Process Profile
type: Class
comment: Entity describing the type, nature, and other relevant information about a process.
term status: stable
change history: https://credreg.net/qdata/termhistory/ceterms/ProcessProfile/json
subclass of: CreativeWork
domain for: Description
domain for: External Input Type
domain for: Jurisdiction
domain for: Name
domain for: Process Frequency
domain for: Processing Agent
domain for: Process Method
domain for: Process Method Description
domain for: Verification Method Description
domain for: Data Collection Method Type

Data Profile
type: Class
comment: Entity describing the attributes of the data set, its subjects and their values.
term status: stable
change history: https://credreg.net/qdata/termhistory/qdata/DataProfile/json
domain for: Description
domain for: Adjustment
domain for: Data Available
domain for: Data Not Available
domain for: Demographic Earnings Rate
domain for: demographicEmploymentRate
domain for: Earnings Amount
domain for: Earnings Definition
domain for: Earnings Distribution
domain for: Earnings Threshold
domain for: Employment Definition
domain for: Employment Outlook
domain for: Employment Rate
domain for: Faculty-to-Student Ratio
domain for: Holders In Set
domain for: Income Determination Type
domain for: Industry Rate
domain for: Insufficient Employment Criteria
domain for: Meet Employment Criteria
domain for: Non-Completers
domain for: Non-Holders In Set
domain for: Occupation Rate
domain for: Pass Rate
domain for: Regional Earnings Distribution
domain for: Regional Employment Rate
domain for: Related Employment
domain for: Subject Excluded
domain for: Subjects In Set
domain for: Sufficient Employment Criteria
domain for: Total WIOA Completers
domain for: Total WIOA Exiters
domain for: Total WIOA Participants
domain for: Unrelated Employment
domain for: Work Time Threshold

Data Set Distribution
type: Class
comment: A specific representation of a dataset.
term status: unstable
change history: https://credreg.net/qdata/termhistory/qdata/DataSetDistribution/json
domain for: Alternate Name
domain for: Description
domain for: Name
domain for: Conforms To
domain for: Media Type

Data Set Profile
type: Class
comment: Particular characteristics or properties of a data set and its records.
term status: stable
change history: https://credreg.net/qdata/termhistory/qdata/DataSetProfile/json
domain for: Administration Process
domain for: Alternate Name
domain for: CTID
domain for: Description
domain for: Instructional Program Type
domain for: Jurisdiction
domain for: Name
domain for: Source URL
domain for: Data Provider
domain for: Data Set Spatial Coverage
domain for: Data Set Temporal Coverage
domain for: Data Set Time Period
domain for: Data Suppression Policy
domain for: Has Data Set Distribution
domain for: Has Data Set Service
domain for: Has Dimension
domain for: Has Metric
domain for: Has Observation
domain for: Relevant Data Set For
domain for: Subject Identification
domain for: About

Data Set Service
type: Class
comment: A service that provides access to one or more datasets or data processing functions.
term status: unstable
change history: https://credreg.net/qdata/termhistory/qdata/DataSetService/json
domain for: Alternate Name
domain for: Description
domain for: Name

Data Set Time Frame
type: Class
comment: Time frame including earnings and employment start and end dates of the data set.
term status: stable
change history: https://credreg.net/qdata/termhistory/qdata/DataSetTimeFrame/json
domain for: Alternate Name
domain for: Description
domain for: End Date
domain for: Name
domain for: Start Date
domain for: Data Attributes
domain for: Time Interval

Dimension
type: Class
comment: Aspect or characteristic along which observations in a dataset can be organized and identified.
term status: unstable
change history: https://credreg.net/qdata/termhistory/qdata/Dimension/json
domain for: Description
domain for: Name
domain for: Dimension Type
domain for: Has Point

Metric
type: Class
comment: What is being measured and the method of measurement used for observations within a data set.
term status: unstable
change history: https://credreg.net/qdata/termhistory/qdata/Metric/json
domain for: CTID
domain for: Description
domain for: Name
domain for: Adjustment
domain for: Earnings Definition
domain for: Earnings Threshold
domain for: Employment Definition
domain for: Income Determination Type
domain for: Metric Type
domain for: Record Type

Observation
type: Class
comment: Data within a dataset defined by specific values for all relevant dimensions and associated with measured values.
term status: unstable
change history: https://credreg.net/qdata/termhistory/qdata/Observation/json
domain for: At Point
domain for: Data Withholding Type
domain for: Is Observation Of
domain for: Max Percentage
domain for: Mean
domain for: Median
domain for: Min Percentage
domain for: Percentage
domain for: Percentile 10
domain for: Percentile 25
domain for: Percentile 75
domain for: Percentile 90
domain for: Size of Data
domain for: Size of No Data
domain for: Size of Population
domain for: Standard Deviation
domain for: Currency
domain for: Maximum Value
domain for: Minimum Value
domain for: Value

Monetary Amount
type: Class
comment: Monetary value or range.
term status: stable
change history: https://credreg.net/qdata/termhistory/schema/MonetaryAmount/json
domain for: Data Withholding Type
domain for: Currency
domain for: Description
domain for: Maximum Value
domain for: Minimum Value
domain for: Unit Text
domain for: Value

Monetary Amount Distribution
type: Class
comment: Statistical distribution of monetary amounts.
term status: stable
change history: https://credreg.net/qdata/termhistory/schema/MonetaryAmountDistribution/json
domain for: Data Withholding Type
domain for: Median
domain for: Percentile 10
domain for: Percentile 25
domain for: Percentile 75
domain for: Percentile 90
domain for: Currency

Quantitative Value
type: Class
comment: A point value or interval for product characteristics and other purposes.
usage note: Use in CTDL to describe quantitative values such as minimum and maximum credits or credit hours, etc.
term status: stable
change history: https://credreg.net/qdata/termhistory/schema/QuantitativeValue/json
domain for: Data Withholding Type
domain for: Max Percentage
domain for: Min Percentage
domain for: Percentage
domain for: Description
domain for: Maximum Value
domain for: Minimum Value
domain for: Unit Text
domain for: Value

Administration Process
type: Property
comment: Description of a process by which a resource is administered.
description: Processes described include the execution of events and the development of resources in the lifecycle of a credential or organization, such as the process for the proctoring of assessments.
usage note: For assessments and rubrics, this can be used to indicate the scoring algorithm.
term status: stable
change history: https://credreg.net/qdata/termhistory/ceterms/administrationProcess/json
domain includes: Data Set Profile
range includes: Process Profile

Alternate Name
type: Property
comment: Alias for the entity including acronyms, alpha-numeric notations, and other forms of name abbreviations in common use.
term status: stable
change history: https://credreg.net/qdata/termhistory/ceterms/alternateName/json
domain includes: AcademicCertificate
domain includes: AggregateDataProfile
domain includes: AlignmentMap
domain includes: ApprenticeshipCertificate
domain includes: AssessmentComponent
domain includes: AssessmentProfile
domain includes: AssociateDegree
domain includes: AssociateOfAppliedArtsDegree
domain includes: AssociateOfAppliedScienceDegree
domain includes: AssociateOfArtsDegree
domain includes: AssociateOfScienceDegree
domain includes: BachelorDegree
domain includes: BachelorOfArtsDegree
domain includes: BachelorOfScienceDegree
domain includes: Badge
domain includes: BasicComponent
domain includes: BasicTechnicalCertificate
domain includes: Certificate
domain includes: CertificateOfCompletion
domain includes: CertificateOfParticipation
domain includes: Certification
domain includes: CocurricularComponent
domain includes: Collection
domain includes: CollectionComponent
domain includes: CollectionMember
domain includes: CompetencyComponent
domain includes: ComponentCondition
domain includes: ConditionManifest
domain includes: ConditionProfile
domain includes: Constraint
domain includes: ContactPoint
domain includes: CostManifest
domain includes: CostProfile
domain includes: Course
domain includes: CourseComponent
domain includes: Credential
domain includes: CredentialComponent
domain includes: CredentialOrganization
domain includes: CredentialType
domain includes: Degree
domain includes: DigitalBadge
domain includes: Diploma
domain includes: DoctoralDegree
domain includes: Earnings Profile
domain includes: Employment Outcome Profile
domain includes: ExtracurricularComponent
domain includes: FinancialAssistanceProfile
domain includes: GeneralEducationDevelopment
domain includes: GeneralEducationLevel1Certificate
domain includes: GeneralEducationLevel2Certificate
domain includes: GeoCoordinates
domain includes: HigherEducationLevel1Certificate
domain includes: HigherEducationLevel2Certificate
domain includes: Holders Profile
domain includes: Industry
domain includes: Job
domain includes: JobComponent
domain includes: JourneymanCertificate
domain includes: LearningOpportunityProfile
domain includes: LearningProgram
domain includes: License
domain includes: MasterCertificate
domain includes: MasterDegree
domain includes: MasterOfArtsDegree
domain includes: MasterOfScienceDegree
domain includes: MicroCredential
domain includes: MultiComponent
domain includes: Occupation
domain includes: OpenBadge
domain includes: Organization
domain includes: Pathway
domain includes: PathwaySet
domain includes: Place
domain includes: PostalAddress
domain includes: PostBaccalaureateCertificate

CTID
type: Property
comment: Globally unique Credential Transparency Identifier (CTID) by which the creator, owner or provider of a resource recognizes it in transactions with the external environment (e.g., in verifiable claims involving the resource).
description: The CTID is the equivalent of a version identifier for the resource. Different versions of a resource are considered distinct expressions and each must be assigned its own CTID. Each version of a resource can have only one CTID assigned. However, a single version of a resource may have distinct identifier values for both the ctid property and the credentialId property. In such a case both identifiers will be recognized by the resource creator/owner/provider in transactions with the external environment.
term status: stable
change history: https://credreg.net/qdata/termhistory/ceterms/ctid/json
sub property of: credentialId
domain includes: Data Set Profile
domain includes: Metric
range includes: string

Description
type: Property
comment: Statement, characterization or account of the entity.
term status: stable
change history: https://credreg.net/qdata/termhistory/ceterms/description/json
domain includes: AcademicCertificate
domain includes: AccreditAction
domain includes: AdvancedStandingAction
domain includes: AggregateDataProfile
domain includes: AlignmentMap
domain includes: AlignmentObject
domain includes: ApprenticeshipCertificate
domain includes: ApproveAction
domain includes: AssessmentComponent
domain includes: AssessmentProfile
domain includes: AssociateDegree
domain includes: AssociateOfAppliedArtsDegree
domain includes: AssociateOfAppliedScienceDegree
domain includes: AssociateOfArtsDegree
domain includes: AssociateOfScienceDegree
domain includes: BachelorDegree
domain includes: BachelorOfArtsDegree
domain includes: BachelorOfScienceDegree
domain includes: Badge
domain includes: BasicComponent
domain includes: BasicTechnicalCertificate
domain includes: Certificate
domain includes: CertificateOfCompletion
domain includes: CertificateOfParticipation
domain includes: Certification
domain includes: CocurricularComponent
domain includes: Collection
domain includes: CollectionComponent
domain includes: CollectionMember
domain includes: CompetencyComponent
domain includes: ComponentCondition
domain includes: ConditionManifest
domain includes: ConditionProfile
domain includes: Constraint
domain includes: CostManifest
domain includes: CostProfile
domain includes: Course
domain includes: CourseComponent
domain includes: Credential
domain includes: CredentialComponent
domain includes: CredentialingAction
domain includes: CredentialOrganization
domain includes: CredentialType
domain includes: Degree
domain includes: DigitalBadge
domain includes: Diploma
domain includes: DoctoralDegree
domain includes: DurationProfile
domain includes: Earnings Profile
domain includes: Employment Outcome Profile
domain includes: EvaluationOutcome
domain includes: ExtracurricularComponent
domain includes: FinancialAssistanceProfile
domain includes: GeneralEducationDevelopment
domain includes: GeneralEducationLevel1Certificate
domain includes: GeneralEducationLevel2Certificate
domain includes: HigherEducationLevel1Certificate
domain includes: HigherEducationLevel2Certificate
domain includes: Holders Profile
domain includes: Industry
domain includes: Job
domain includes: JobComponent
domain includes: JourneymanCertificate
domain includes: Jurisdiction Profile
domain includes: LearningOpportunityProfile
domain includes: LearningProgram
domain includes: License
domain includes: MasterCertificate
domain includes: MasterDegree
domain includes: MasterOfArtsDegree
domain includes: MasterOfScienceDegree
domain includes: MicroCredential
domain includes: MultiComponent
domain includes: Occupation
domain includes: OfferAction

Earnings
type: Property
comment: Entity describing aggregate credential holder earnings data.
usage note: The use of ceterms:aggregateData instead of this property is strongly recommended.
term status: stable
change history: https://credreg.net/qdata/termhistory/ceterms/earnings/json
sub property of: aggregateData
domain includes: AcademicCertificate
domain includes: ApprenticeshipCertificate
domain includes: AssociateDegree
domain includes: AssociateOfAppliedArtsDegree
domain includes: AssociateOfAppliedScienceDegree
domain includes: AssociateOfArtsDegree
domain includes: AssociateOfScienceDegree
domain includes: BachelorDegree
domain includes: BachelorOfArtsDegree
domain includes: BachelorOfScienceDegree
domain includes: Badge
domain includes: BasicTechnicalCertificate
domain includes: Certificate
domain includes: CertificateOfCompletion
domain includes: CertificateOfParticipation
domain includes: Certification
domain includes: Credential
domain includes: Degree
domain includes: DigitalBadge
domain includes: Diploma
domain includes: DoctoralDegree
domain includes: GeneralEducationDevelopment
domain includes: GeneralEducationLevel1Certificate
domain includes: GeneralEducationLevel2Certificate
domain includes: HigherEducationLevel1Certificate
domain includes: HigherEducationLevel2Certificate
domain includes: JourneymanCertificate
domain includes: License
domain includes: MasterCertificate
domain includes: MasterDegree
domain includes: MasterOfArtsDegree
domain includes: MasterOfScienceDegree
domain includes: MicroCredential
domain includes: OpenBadge
domain includes: PostBaccalaureateCertificate
domain includes: PostMasterCertificate
domain includes: PreApprenticeshipCertificate
domain includes: ProfessionalCertificate
domain includes: ProfessionalDoctorate
domain includes: ProficiencyCertificate
domain includes: QualityAssuranceCredential
domain includes: ResearchDoctorate
domain includes: SecondaryEducationCertificate
domain includes: SecondarySchoolDiploma
domain includes: SpecialistDegree
domain includes: TechnicalLevel1Certificate
domain includes: TechnicalLevel2Certificate
domain includes: TechnicalLevel3Certificate
domain includes: WorkBasedLearningCertificate
range includes: Earnings Profile

Employment Outcome
type: Property
comment: Entity describing aggregate data on jobs obtained with the credential by occupation and industry for a given period of time in a specific region.
usage note: The use of ceterms:aggregateData instead of this property is strongly recommended.
term status: stable
change history: https://credreg.net/qdata/termhistory/ceterms/employmentOutcome/json
sub property of: aggregateData
domain includes: AcademicCertificate
domain includes: ApprenticeshipCertificate
domain includes: AssociateDegree
domain includes: AssociateOfAppliedArtsDegree
domain includes: AssociateOfAppliedScienceDegree
domain includes: AssociateOfArtsDegree
domain includes: AssociateOfScienceDegree
domain includes: BachelorDegree
domain includes: BachelorOfArtsDegree
domain includes: BachelorOfScienceDegree
domain includes: Badge
domain includes: BasicTechnicalCertificate
domain includes: Certificate
domain includes: CertificateOfCompletion
domain includes: CertificateOfParticipation
domain includes: Certification
domain includes: Credential
domain includes: Degree
domain includes: DigitalBadge
domain includes: Diploma
domain includes: DoctoralDegree
domain includes: GeneralEducationDevelopment
domain includes: GeneralEducationLevel1Certificate
domain includes: GeneralEducationLevel2Certificate
domain includes: HigherEducationLevel1Certificate
domain includes: HigherEducationLevel2Certificate
domain includes: JourneymanCertificate
domain includes: License
domain includes: MasterCertificate
domain includes: MasterDegree
domain includes: MasterOfArtsDegree
domain includes: MasterOfScienceDegree
domain includes: MicroCredential
domain includes: OpenBadge
domain includes: PostBaccalaureateCertificate
domain includes: PostMasterCertificate
domain includes: PreApprenticeshipCertificate
domain includes: ProfessionalCertificate
domain includes: ProfessionalDoctorate
domain includes: ProficiencyCertificate
domain includes: QualityAssuranceCredential
domain includes: ResearchDoctorate
domain includes: SecondaryEducationCertificate
domain includes: SecondarySchoolDiploma
domain includes: SpecialistDegree
domain includes: TechnicalLevel1Certificate
domain includes: TechnicalLevel2Certificate
domain includes: TechnicalLevel3Certificate
domain includes: WorkBasedLearningCertificate
range includes: Employment Outcome Profile

End Date
type: Property
comment: Date some event or activity ends.
term status: stable
change history: https://credreg.net/qdata/termhistory/ceterms/endDate/json
sub property of: temporalCoverage
domain includes: AccreditAction
domain includes: AdvancedStandingAction
domain includes: ApproveAction
domain includes: CollectionMember
domain includes: CostManifest
domain includes: CostProfile
domain includes: CredentialingAction
domain includes: OfferAction
domain includes: RecognizeAction
domain includes: RegistrationAction
domain includes: RegulateAction
domain includes: RenewAction
domain includes: RevokeAction
domain includes: RightsAction
domain includes: TransferValueProfile
domain includes: WorkforceDemandAction
domain includes: Data Set Time Frame
range includes: date
equivalent property: endDate

External Input Type
type: Property
comment: Types of external stakeholders that provide input to an entity's processes or resources; select from an existing enumeration of such types.
usage note: Best practice for developing credential descriptions for the Credential Engine Registry is to use the ceterms:ExternalInput vocabulary.
term status: stable
change history: https://credreg.net/qdata/termhistory/ceterms/externalInputType/json
sub property of: credentialAlignment
domain includes: Process Profile
range includes: CredentialAlignmentObject
target scheme: ExternalInput

Geographic URI
type: Property
comment: Entity that describes the longitude, latitude and other location details of a place.
description: This may define a place at any scale. Examples include a city, state, province, country, or continent.
usage note: It is recommended to use services such as http://www.geonames.org to provide values for this property.
term status: stable
change history: https://credreg.net/qdata/termhistory/ceterms/geoURI/json
domain includes: GeoCoordinates
domain includes: Place
range includes: anyURI

Has Sub-framework scheme
type: Property
comment: Indicates a Concept Scheme used to differentiate parts of a framework or related resources that are considered to be somewhat independent.
description: Examples include differentiating those progression levels or credential types that are relevant to different sectors, such as General Education, Higher Education and Technical / Vocational Education and Training.
term status: unstable
change history: https://credreg.net/qdata/termhistory/ceterms/hasSubFrameworkScheme/json
domain includes: QualificationsFramework
range includes: ConceptScheme

Instructional Program Type
type: Property
comment: Type of instructional program; select from an existing enumeration of such types.
usage note: For U.S. credentials, best practice is to use a framework such as the CIP (Classification of Instructional Programs). Other credentials may use any framework of the class CTDL InstructionalProgramClassification.
term status: stable
change history: https://credreg.net/qdata/termhistory/ceterms/instructionalProgramType/json
sub property of: credentialAlignment
domain includes: Competency
domain includes: CompetencyFramework
domain includes: Rubric
domain includes: AcademicCertificate
domain includes: ApprenticeshipCertificate
domain includes: AssessmentProfile
domain includes: AssociateDegree
domain includes: AssociateOfAppliedArtsDegree
domain includes: AssociateOfAppliedScienceDegree
domain includes: AssociateOfArtsDegree
domain includes: AssociateOfScienceDegree
domain includes: BachelorDegree
domain includes: BachelorOfArtsDegree
domain includes: BachelorOfScienceDegree
domain includes: Badge
domain includes: BasicTechnicalCertificate
domain includes: Certificate
domain includes: CertificateOfCompletion
domain includes: CertificateOfParticipation
domain includes: Certification
domain includes: Collection
domain includes: Course
domain includes: Credential
domain includes: Degree
domain includes: DigitalBadge
domain includes: Diploma
domain includes: DoctoralDegree
domain includes: GeneralEducationDevelopment
domain includes: GeneralEducationLevel1Certificate
domain includes: GeneralEducationLevel2Certificate
domain includes: HigherEducationLevel1Certificate
domain includes: HigherEducationLevel2Certificate
domain includes: JourneymanCertificate
domain includes: LearningOpportunityProfile
domain includes: LearningProgram
domain includes: License
domain includes: MasterCertificate
domain includes: MasterDegree
domain includes: MasterOfArtsDegree
domain includes: MasterOfScienceDegree
domain includes: MicroCredential
domain includes: OpenBadge
domain includes: Pathway
domain includes: PostBaccalaureateCertificate
domain includes: PostMasterCertificate
domain includes: PreApprenticeshipCertificate
domain includes: ProfessionalCertificate
domain includes: ProfessionalDoctorate
domain includes: ProficiencyCertificate
domain includes: QualityAssuranceCredential
domain includes: ResearchDoctorate
domain includes: SecondaryEducationCertificate
domain includes: SecondarySchoolDiploma
domain includes: SpecialistDegree
domain includes: TechnicalLevel1Certificate
domain includes: TechnicalLevel2Certificate
domain includes: TechnicalLevel3Certificate
domain includes: WorkBasedLearningCertificate
domain includes: Data Set Profile
range includes: CredentialAlignmentObject
range includes: Concept
target scheme: InstructionalProgramClassification

Jurisdiction
type: Property
comment: Geographic or political region in which the resource is formally applicable or an organization has authority to act.
term status: stable
change history: https://credreg.net/qdata/termhistory/ceterms/jurisdiction/json
domain includes: AcademicCertificate
domain includes: AggregateDataProfile
domain includes: AlignmentMap
domain includes: ApprenticeshipCertificate
domain includes: AssessmentProfile
domain includes: AssociateDegree
domain includes: AssociateOfAppliedArtsDegree
domain includes: AssociateOfAppliedScienceDegree
domain includes: AssociateOfArtsDegree
domain includes: AssociateOfScienceDegree
domain includes: BachelorDegree
domain includes: BachelorOfArtsDegree
domain includes: BachelorOfScienceDegree
domain includes: Badge
domain includes: BasicTechnicalCertificate
domain includes: Certificate
domain includes: CertificateOfCompletion
domain includes: CertificateOfParticipation
domain includes: Certification
domain includes: ConditionProfile
domain includes: CostProfile
domain includes: Course
domain includes: Credential
domain includes: CredentialOrganization
domain includes: CredentialType
domain includes: Degree
domain includes: DigitalBadge
domain includes: Diploma
domain includes: DoctoralDegree
domain includes: Earnings Profile
domain includes: Employment Outcome Profile
domain includes: GeneralEducationDevelopment
domain includes: GeneralEducationLevel1Certificate
domain includes: GeneralEducationLevel2Certificate
domain includes: HigherEducationLevel1Certificate
domain includes: HigherEducationLevel2Certificate
domain includes: Holders Profile
domain includes: JourneymanCertificate
domain includes: LearningOpportunityProfile
domain includes: LearningProgram
domain includes: License
domain includes: MasterCertificate
domain includes: MasterDegree
domain includes: MasterOfArtsDegree
domain includes: MasterOfScienceDegree
domain includes: MicroCredential
domain includes: OpenBadge
domain includes: Organization
domain includes: PostBaccalaureateCertificate
domain includes: PostMasterCertificate
domain includes: PreApprenticeshipCertificate
domain includes: PriorLearningPolicy
domain includes: Process Profile
domain includes: ProfessionalCertificate
domain includes: ProfessionalDoctorate
domain includes: ProficiencyCertificate
domain includes: QACredentialOrganization
domain includes: QualificationsFramework
domain includes: QualityAssuranceCredential
domain includes: ResearchDoctorate
domain includes: RevocationProfile
domain includes: SecondaryEducationCertificate
domain includes: SecondarySchoolDiploma
domain includes: SpecialistDegree
domain includes: TechnicalLevel1Certificate
domain includes: TechnicalLevel2Certificate
domain includes: TechnicalLevel3Certificate
domain includes: TransferAgreement
domain includes: VerificationServiceProfile
domain includes: WorkBasedLearningCertificate
domain includes: WorkforceDemandAction
domain includes: Data Set Profile
range includes: Jurisdiction Profile

Jurisdiction Exception
type: Property
comment: Geographic or political region in which the credential is not formally recognized or an organization has no authority to act .
description: The ceterms:jurisdictionalException property is used in conjunction with the ceterms:jurisdiction property and expresses any exceptions to a more general statement; e.g., the United states except for Colorado.
term status: stable
change history: https://credreg.net/qdata/termhistory/ceterms/jurisdictionException/json
sub property of: spatialCoverage
domain includes: Jurisdiction Profile
range includes: Place

Latitude
type: Property
comment: Latitude of a location.
description: For example 37.42242 (WGS 84)
term status: stable
change history: https://credreg.net/qdata/termhistory/ceterms/latitude/json
domain includes: GeoCoordinates
domain includes: Place
range includes: float
equivalent property: latitude

Longitude
type: Property
comment: The longitude of a location.
description: For example -122.08585 (WGS 84).
term status: stable
change history: https://credreg.net/qdata/termhistory/ceterms/longitude/json
domain includes: GeoCoordinates
domain includes: Place
range includes: float
equivalent property: longitude

Main Jurisdiction
type: Property
comment: Primary geographic or political region in which the credential is recognized as applicable or in which an organization has recognized authority to act.
term status: stable
change history: https://credreg.net/qdata/termhistory/ceterms/mainJurisdiction/json
sub property of: spatialCoverage
domain includes: Jurisdiction Profile
range includes: Place

Name
type: Property
comment: Name or title of the resource.
term status: stable
change history: https://credreg.net/qdata/termhistory/ceterms/name/json
domain includes: AcademicCertificate
domain includes: AccreditAction
domain includes: AdvancedStandingAction
domain includes: AggregateDataProfile
domain includes: AlignmentMap
domain includes: ApprenticeshipCertificate
domain includes: ApproveAction
domain includes: AssessmentComponent
domain includes: AssessmentProfile
domain includes: AssociateDegree
domain includes: AssociateOfAppliedArtsDegree
domain includes: AssociateOfAppliedScienceDegree
domain includes: AssociateOfArtsDegree
domain includes: AssociateOfScienceDegree
domain includes: BachelorDegree
domain includes: BachelorOfArtsDegree
domain includes: BachelorOfScienceDegree
domain includes: Badge
domain includes: BasicComponent
domain includes: BasicTechnicalCertificate
domain includes: Certificate
domain includes: CertificateOfCompletion
domain includes: CertificateOfParticipation
domain includes: Certification
domain includes: CocurricularComponent
domain includes: Collection
domain includes: CollectionComponent
domain includes: CollectionMember
domain includes: CompetencyComponent
domain includes: ComponentCondition
domain includes: ConditionManifest
domain includes: ConditionProfile
domain includes: Constraint
domain includes: ContactPoint
domain includes: CostManifest
domain includes: CostProfile
domain includes: Course
domain includes: CourseComponent
domain includes: Credential
domain includes: CredentialComponent
domain includes: CredentialingAction
domain includes: CredentialOrganization
domain includes: CredentialType
domain includes: Degree
domain includes: DigitalBadge
domain includes: Diploma
domain includes: DoctoralDegree
domain includes: Earnings Profile
domain includes: Employment Outcome Profile
domain includes: EvaluationOutcome
domain includes: ExtracurricularComponent
domain includes: FinancialAssistanceProfile
domain includes: GeneralEducationDevelopment
domain includes: GeneralEducationLevel1Certificate
domain includes: GeneralEducationLevel2Certificate
domain includes: GeoCoordinates
domain includes: HigherEducationLevel1Certificate
domain includes: HigherEducationLevel2Certificate
domain includes: Holders Profile
domain includes: Industry
domain includes: Job
domain includes: JobComponent
domain includes: JourneymanCertificate
domain includes: LearningOpportunityProfile
domain includes: LearningProgram
domain includes: License
domain includes: MasterCertificate
domain includes: MasterDegree
domain includes: MasterOfArtsDegree
domain includes: MasterOfScienceDegree
domain includes: MicroCredential
domain includes: MultiComponent
domain includes: Occupation
domain includes: OfferAction
domain includes: OpenBadge

Process Frequency
type: Property
comment: Interval of process occurence.
term status: stable
change history: https://credreg.net/qdata/termhistory/ceterms/processFrequency/json
domain includes: Process Profile
range includes: langString

Processing Agent
type: Property
comment: Organization or person performing the process.
term status: stable
change history: https://credreg.net/qdata/termhistory/ceterms/processingAgent/json
domain includes: Process Profile
range includes: CredentialOrganization
range includes: Organization
range includes: QACredentialOrganization

Process Method
type: Property
comment: Webpage or online document that describes the process methods.
term status: stable
change history: https://credreg.net/qdata/termhistory/ceterms/processMethod/json
domain includes: Process Profile
range includes: anyURI

Process Method Description
type: Property
comment: Textual description of the process methods.
term status: stable
change history: https://credreg.net/qdata/termhistory/ceterms/processMethodDescription/json
domain includes: Process Profile
range includes: langString

Source URL
type: Property
comment: Authoritative source of an entity's information.
description: Citation or description of an authoritative source from which information or description has been derived.
term status: stable
change history: https://credreg.net/qdata/termhistory/ceterms/source/json
domain includes: Data Set Profile
range includes: anyURI

Start Date
type: Property
comment: Date the validity or usefulness of the information in this resource begins.
term status: stable
change history: https://credreg.net/qdata/termhistory/ceterms/startDate/json
sub property of: temporalCoverage
domain includes: AccreditAction
domain includes: AdvancedStandingAction
domain includes: ApproveAction
domain includes: CollectionMember
domain includes: CostManifest
domain includes: CostProfile
domain includes: CredentialingAction
domain includes: OfferAction
domain includes: RecognizeAction
domain includes: RegistrationAction
domain includes: RegulateAction
domain includes: RenewAction
domain includes: RevokeAction
domain includes: RightsAction
domain includes: TransferValueProfile
domain includes: WorkforceDemandAction
domain includes: Data Set Time Frame
range includes: date
equivalent property: startDate

Verification Method Description
type: Property
comment: Textual description of the methods used to evaluate an assessment, learning opportunity, process or verificaiton service for validity or reliability.
term status: stable
change history: https://credreg.net/qdata/termhistory/ceterms/verificationMethodDescription/json
domain includes: Process Profile
domain includes: VerificationServiceProfile
range includes: langString

Adjustment
type: Property
comment: Describes whether and how the Observations have been adjusted for relevant factors.
description: Examples of factors include inflation, participant demographics, economic conditions, etc.
term status: stable
change history: https://credreg.net/qdata/termhistory/qdata/adjustment/json
domain includes: Data Profile
domain includes: Metric
range includes: langString

At Point
type: Property
comment: A point in a Dimension that represents a resource or factor relevant to this Observation.
term status: unstable
change history: https://credreg.net/qdata/termhistory/qdata/atPoint/json
domain includes: Observation
range includes: Resource

Conforms To
type: Property
comment: An established standard to which the described resource conforms.
term status: unstable
change history: https://credreg.net/qdata/termhistory/qdata/conformsTo/json
domain includes: Data Set Distribution
range includes: Standard
equivalent property: conformsTo

Data Attributes
type: Property
comment: Attributes of the data set.
term status: stable
change history: https://credreg.net/qdata/termhistory/qdata/dataAttributes/json
domain includes: Data Set Time Frame
range includes: Data Profile

Data Available
type: Property
comment: Number of credential holders in the reporting group for which employment and earnings data is included in the data set.
term status: stable
change history: https://credreg.net/qdata/termhistory/qdata/dataAvailable/json
domain includes: Data Profile
range includes: Quantitative Value

Data Collection Method Type
type: Property
comment: Type of method by which the data was collected.
term status: stable
change history: https://credreg.net/qdata/termhistory/qdata/dataCollectionMethodType/json
domain includes: Process Profile
range includes: Concept
target scheme: Collection Method

Data Not Available
type: Property
comment: Number of credential holders in the reporting group for which employment and earnings data has not been included in the data set.
term status: stable
change history: https://credreg.net/qdata/termhistory/qdata/dataNotAvailable/json
domain includes: Data Profile
range includes: Quantitative Value

Data Provider
type: Property
comment: Credentialing organization or a third party providing the data.
term status: stable
change history: https://credreg.net/qdata/termhistory/qdata/dataProvider/json
domain includes: Data Set Profile
range includes: CredentialOrganization
range includes: Organization
range includes: QACredentialOrganization

Data Set Spatial Coverage
type: Property
comment: Location or geographic area for a data set.
term status: unstable
change history: https://credreg.net/qdata/termhistory/qdata/dataSetSpatialCoverage/json
domain includes: Data Set Profile
range includes: Place

Data Set Temporal Coverage
type: Property
comment: Time period covered by the data.
term status: unstable
change history: https://credreg.net/qdata/termhistory/qdata/dataSetTemporalCoverage/json
domain includes: Data Set Profile
range includes: Data Set Time Frame

Data Set Time Period
type: Property
comment: Short- and long-term post-award reporting intervals including start and end dates.
term status: stable
change history: https://credreg.net/qdata/termhistory/qdata/dataSetTimePeriod/json
domain includes: Data Set Profile
range includes: Data Set Time Frame

Data Source Coverage Type
type: Property
comment: Type of geographic coverage of the subjects.
term status: stable
change history: https://credreg.net/qdata/termhistory/qdata/dataSourceCoverageType/json
range includes: Concept
target scheme: Data Source Coverage

Data Suppression Policy
type: Property
comment: Description of a data suppression policy for earnings and employment data when cell size is below a certain threshold to ensure an individual's privacy and security.
term status: stable
change history: https://credreg.net/qdata/termhistory/qdata/dataSuppressionPolicy/json
domain includes: Data Set Profile
range includes: langString

Data Withholding Type
type: Property
comment: Type of suppression, masking, or other modification made to the data to protect the identities of its subjects.
term status: stable
change history: https://credreg.net/qdata/termhistory/qdata/dataWithholdingType/json
domain includes: Observation
domain includes: Monetary Amount
domain includes: Monetary Amount Distribution
domain includes: Quantitative Value
range includes: Concept
target scheme: Data Withholding Category

Demographic Earnings Rate
type: Property
comment: Earnings rate for a demographic category.
term status: stable
change history: https://credreg.net/qdata/termhistory/qdata/demographicEarningsRate/json
domain includes: Data Profile
range includes: Quantitative Value

demographicEmploymentRate
type: Property
comment: Employment rate for a demographic category.
term status: stable
change history: https://credreg.net/qdata/termhistory/qdata/demographicEmploymentRate/json
domain includes: Data Profile
range includes: Quantitative Value

Dimension Type
type: Property
comment: Type of resource that may be a point in the dimension; select from existing classes and concept schemes.
description: Items in a dimension will typically be instances of CTDL classes or concepts drawn from a CTDL concept scheme.
term status: unstable
change history: https://credreg.net/qdata/termhistory/qdata/dimensionType/json
domain includes: Dimension
range includes: Class
range includes: Concept
range includes: ConceptScheme

Earnings Amount
type: Property
comment: Reference to an entity describing aggregate earnings.
term status: stable
change history: https://credreg.net/qdata/termhistory/qdata/earningsAmount/json
domain includes: Data Profile
range includes: Monetary Amount

Earnings Definition
type: Property
comment: Definition of "earnings" used by the data source.
term status: stable
change history: https://credreg.net/qdata/termhistory/qdata/earningsDefinition/json
domain includes: Data Profile
domain includes: Metric
range includes: langString

Earnings Distribution
type: Property
comment: Reference to an entity describing median earnings as well as earnings at various percentiles.
term status: stable
change history: https://credreg.net/qdata/termhistory/qdata/earningsDistribution/json
domain includes: Data Profile
range includes: Monetary Amount Distribution

Earnings Threshold
type: Property
comment: Statement of any work time or earnings threshold used in determining whether a sufficient level of workforce attachment has been achieved to qualify as employed during the time period of the data set.
term status: stable
change history: https://credreg.net/qdata/termhistory/qdata/earningsThreshold/json
domain includes: Data Profile
domain includes: Metric
range includes: langString

Employment Definition
type: Property
comment: Definition of employment used by the data source.
term status: stable
change history: https://credreg.net/qdata/termhistory/qdata/employmentDefinition/json
domain includes: Data Profile
domain includes: Metric
range includes: langString

Employment Outlook
type: Property
comment: Projected employment estimate.
term status: stable
change history: https://credreg.net/qdata/termhistory/qdata/employmentOutlook/json
domain includes: Data Profile
range includes: Quantitative Value

Employment Rate
type: Property
comment: Rate computed by dividing the number of holders or subjects meeting the data set's criteria of employment (meetEmploymentCriteria) by the number of holders or subjects for which data was available (dataAvailable).
term status: stable
change history: https://credreg.net/qdata/termhistory/qdata/employmentRate/json
domain includes: Data Profile
range includes: Quantitative Value

Faculty-to-Student Ratio
type: Property
comment: Ratio of the number of teaching faculty to the number of students.
description: What constitutes "teaching faculty" is determined by the Organization and may include anyone with a significant, direct instructional role in interactions with students in learning activities.
usage note: The expression of the ratio should feature the number of faculty first, followed by the number of students, e.g., "1:10" to mean "one faculty per ten students".
term status: unstable
change history: https://credreg.net/qdata/termhistory/qdata/facultyToStudentRatio/json
domain includes: AggregateDataProfile
domain includes: Data Profile
range includes: string

Has Data Set Distribution
type: Property
comment: A representation of the data set.
term status: unstable
change history: https://credreg.net/qdata/termhistory/qdata/hasDataSetDistribution/json
domain includes: Data Set Profile
range includes: Data Set Distribution

Has Data Set Service
type: Property
comment: A means of accessing one or more data sets or data processing functions.
term status: unstable
change history: https://credreg.net/qdata/termhistory/qdata/hasDataSetService/json
domain includes: Data Set Profile
range includes: Data Set Service

Has Dimension
type: Property
comment: A set of resources or concepts to which the metric is applied or which affect the observation of the metric.
description: The metric may be applied to or affected by resources such as credential earned, industry of employment, year of graduation, location etc.
term status: unstable
change history: https://credreg.net/qdata/termhistory/qdata/hasDimension/json
domain includes: Data Set Profile
range includes: Dimension

Has Metric
type: Property
comment: What the observations measure and details of the method used.
term status: unstable
change history: https://credreg.net/qdata/termhistory/qdata/hasMetric/json
domain includes: Data Set Profile
range includes: Metric

Has Observation
type: Property
comment: The recorded data.
term status: unstable
change history: https://credreg.net/qdata/termhistory/qdata/hasObservation/json
domain includes: Data Set Profile
range includes: Observation

Has Point
type: Property
comment: Identifies a specific entity in a Dimension.
usage note: The value of this property will be a resource with any type, e.g. skos:Concept, ceterms:Credential (or any subclass thereof), ceterms:Industry, ceterms:Place, etc.
term status: unstable
change history: https://credreg.net/qdata/termhistory/qdata/hasPoint/json
domain includes: Dimension
range includes: Resource

Holders In Set
type: Property
comment: Number of credential holders in the final data collection and reporting.
term status: stable
change history: https://credreg.net/qdata/termhistory/qdata/holdersInSet/json
domain includes: Data Profile
range includes: Quantitative Value

Income Determination Type
type: Property
comment: Mechanism by which income is determined; i.e., actual or annualized earnings; select from an enumeration of such types.
term status: stable
change history: https://credreg.net/qdata/termhistory/qdata/incomeDeterminationType/json
domain includes: Data Profile
domain includes: Metric
range includes: Concept
target scheme: Income Determination Method

Industry Rate
type: Property
comment: Employment rate for an industry category.
term status: stable
change history: https://credreg.net/qdata/termhistory/qdata/industryRate/json
domain includes: Data Profile
range includes: Quantitative Value

Insufficient Employment Criteria
type: Property
comment: Number of holders that do not meet the prescribed employment threshold in terms of earnings or time engaged in work as defined for the data set (employmentDefinition).
term status: stable
change history: https://credreg.net/qdata/termhistory/qdata/insufficientEmploymentCriteria/json
domain includes: Data Profile
range includes: Quantitative Value

Is Observation Of
type: Property
comment: Indicates the metric used for this Observation.
term status: unstable
change history: https://credreg.net/qdata/termhistory/qdata/isObservationOf/json
domain includes: Observation
range includes: Metric

Max Percentage
type: Property
comment: The upper percentage of some characteristic or property.
usage note: Best practice is to treat the value of this property as a verbatim percentage; for example, a value of 1.5 should be interpreted as 1.5%
term status: unstable
change history: https://credreg.net/qdata/termhistory/qdata/maxPercentage/json
domain includes: CriterionLevel
domain includes: ValueProfile
domain includes: Observation
domain includes: Quantitative Value
range includes: float

Mean
type: Property
comment: Mean value.
term status: unstable
change history: https://credreg.net/qdata/termhistory/qdata/mean/json
domain includes: Observation
range includes: float

Median
type: Property
comment: Median value.
term status: stable
change history: https://credreg.net/qdata/termhistory/qdata/median/json
domain includes: Observation
domain includes: Monetary Amount Distribution
range includes: float

Media Type
type: Property
comment: A file format or physical medium.
term status: unstable
change history: https://credreg.net/qdata/termhistory/qdata/mediaType/json
sub property of: format
domain includes: Data Set Distribution
range includes: string

Meet Employment Criteria
type: Property
comment: Number of holders that meet the prescribed employment threshold in terms of earnings or time engaged in work as defined for the data set (employmentDefinition).
term status: stable
change history: https://credreg.net/qdata/termhistory/qdata/meetEmploymentCriteria/json
domain includes: Data Profile
range includes: Quantitative Value

Metric Type
type: Property
comment: Type of phenomenon being measured; select from an existing enumeration of such types.
term status: unstable
change history: https://credreg.net/qdata/termhistory/qdata/metricType/json
domain includes: Metric
range includes: Concept
target scheme: Metric Category

Min Percentage
type: Property
comment: The lower percentage of some characteristic or property.
usage note: Best practice is to treat the value of this property as a verbatim percentage; for example, a value of 1.5 should be interpreted as 1.5%
term status: unstable
change history: https://credreg.net/qdata/termhistory/qdata/minPercentage/json
domain includes: CriterionLevel
domain includes: ValueProfile
domain includes: Observation
domain includes: Quantitative Value
range includes: float

Non-Completers
type: Property
comment: Non-holders who departed or are likely to depart higher education prematurely.
term status: stable
change history: https://credreg.net/qdata/termhistory/qdata/nonCompleters/json
domain includes: Data Profile
range includes: Quantitative Value

Non-Holders In Set
type: Property
comment: Non-holder subject actively pursuing the credential through a program or assessment.
term status: stable
change history: https://credreg.net/qdata/termhistory/qdata/nonHoldersInSet/json
domain includes: Data Profile
range includes: Quantitative Value

Occupation Rate
type: Property
comment: Employment rate for an occupation category.
term status: stable
change history: https://credreg.net/qdata/termhistory/qdata/occupationRate/json
domain includes: Data Profile
range includes: Quantitative Value

Pass Rate
type: Property
comment: Rate computed by dividing the number of subjects passing an assessment by the total number taking the assessment.
usage note: When data is available, record both the percentage and the number of subjects who passed the assessment.
term status: stable
change history: https://credreg.net/qdata/termhistory/qdata/passRate/json
domain includes: Data Profile
range includes: Quantitative Value

Percentage
type: Property
comment: Quotient of two values of the data set, expressed as a percentage.
usage note: Best practice is to treat the value of this property as a verbatim percentage; for example, a value of 1.5 should be interpreted as 1.5%
term status: stable
change history: https://credreg.net/qdata/termhistory/qdata/percentage/json
domain includes: CriterionLevel
domain includes: ValueProfile
domain includes: Observation
domain includes: Quantitative Value
range includes: float

Percentile 10
type: Property
comment: 10th percentile value.
term status: stable
change history: https://credreg.net/qdata/termhistory/qdata/percentile10/json
domain includes: Observation
domain includes: Monetary Amount Distribution
range includes: float

Percentile 25
type: Property
comment: 25th percentile value.
term status: stable
change history: https://credreg.net/qdata/termhistory/qdata/percentile25/json
domain includes: Observation
domain includes: Monetary Amount Distribution
range includes: float

Percentile 75
type: Property
comment: 75th percentile value.
term status: stable
change history: https://credreg.net/qdata/termhistory/qdata/percentile75/json
domain includes: Observation
domain includes: Monetary Amount Distribution
range includes: float

Percentile 90
type: Property
comment: 90th percentile value.
term status: stable
change history: https://credreg.net/qdata/termhistory/qdata/percentile90/json
domain includes: Observation
domain includes: Monetary Amount Distribution
range includes: float

Record Type
type: Property
comment: Type of record used to source the data.
description: Examples include various official records and self-reporting via a survey.
term status: unstable
change history: https://credreg.net/qdata/termhistory/qdata/recordType/json
domain includes: Metric
range includes: Concept

Regional Earnings Distribution
type: Property
comment: Reference to an entity describing median earnings as well as earnings at various percentiles for holders or subjects in the region.
term status: stable
change history: https://credreg.net/qdata/termhistory/qdata/regionalEarningsDistribution/json
sub property of: Earnings Distribution
domain includes: Data Profile
range includes: Quantitative Value

Regional Employment Rate
type: Property
comment: Rate computed by dividing the number of holders or subjects in the region meeting the data set's criteria of employment (meetEmploymentCriteria) by the number of holders or subjects in the region for which data was available (dataAvailable).
term status: stable
change history: https://credreg.net/qdata/termhistory/qdata/regionalEmploymentRate/json
sub property of: Employment Rate
domain includes: Data Profile
range includes: Quantitative Value

Related Employment
type: Property
comment: Number of people employed in the area of work (e.g., industry, occupation) in which the credential provided preparation.
term status: stable
change history: https://credreg.net/qdata/termhistory/qdata/relatedEmployment/json
domain includes: Data Profile
range includes: Quantitative Value

Relevant Data Set
type: Property
comment: Data Set on which earnings or employment data is based.
term status: stable
change history: https://credreg.net/qdata/termhistory/qdata/relevantDataSet/json
domain includes: AcademicCertificate
domain includes: ApprenticeshipCertificate
domain includes: AssessmentProfile
domain includes: AssociateDegree
domain includes: AssociateOfAppliedArtsDegree
domain includes: AssociateOfAppliedScienceDegree
domain includes: AssociateOfArtsDegree
domain includes: AssociateOfScienceDegree
domain includes: BachelorDegree
domain includes: BachelorOfArtsDegree
domain includes: BachelorOfScienceDegree
domain includes: Badge
domain includes: BasicTechnicalCertificate
domain includes: Certificate
domain includes: CertificateOfCompletion
domain includes: CertificateOfParticipation
domain includes: Certification
domain includes: Course
domain includes: Credential
domain includes: CredentialOrganization
domain includes: CredentialType
domain includes: Degree
domain includes: DigitalBadge
domain includes: Diploma
domain includes: DoctoralDegree
domain includes: GeneralEducationDevelopment
domain includes: GeneralEducationLevel1Certificate
domain includes: GeneralEducationLevel2Certificate
domain includes: HigherEducationLevel1Certificate
domain includes: HigherEducationLevel2Certificate
domain includes: Industry
domain includes: Job
domain includes: JourneymanCertificate
domain includes: LearningOpportunityProfile
domain includes: LearningProgram
domain includes: License
domain includes: MasterCertificate
domain includes: MasterDegree
domain includes: MasterOfArtsDegree
domain includes: MasterOfScienceDegree
domain includes: MicroCredential
domain includes: Occupation
domain includes: OpenBadge
domain includes: Organization
domain includes: Pathway
domain includes: PostBaccalaureateCertificate
domain includes: PostMasterCertificate
domain includes: PreApprenticeshipCertificate
domain includes: ProfessionalCertificate
domain includes: ProfessionalDoctorate
domain includes: ProficiencyCertificate
domain includes: QACredentialOrganization
domain includes: QualityAssuranceCredential
domain includes: ResearchDoctorate
domain includes: SecondaryEducationCertificate
domain includes: SecondarySchoolDiploma
domain includes: SpecialistDegree
domain includes: TechnicalLevel1Certificate
domain includes: TechnicalLevel2Certificate
domain includes: TechnicalLevel3Certificate
domain includes: WorkBasedLearningCertificate
range includes: Data Set Profile

Relevant Data Set For
type: Property
comment: Data set for the entity being referenced.
term status: stable
change history: https://credreg.net/qdata/termhistory/qdata/relevantDataSetFor/json
domain includes: Data Set Profile
range includes: AcademicCertificate
range includes: ApprenticeshipCertificate
range includes: AssessmentProfile
range includes: AssociateDegree
range includes: AssociateOfAppliedArtsDegree
range includes: AssociateOfAppliedScienceDegree
range includes: AssociateOfArtsDegree
range includes: AssociateOfScienceDegree
range includes: BachelorDegree
range includes: BachelorOfArtsDegree
range includes: BachelorOfScienceDegree
range includes: Badge
range includes: BasicTechnicalCertificate
range includes: Certificate
range includes: CertificateOfCompletion
range includes: CertificateOfParticipation
range includes: Certification
range includes: Course
range includes: Credential
range includes: CredentialOrganization
range includes: Degree
range includes: DigitalBadge
range includes: Diploma
range includes: DoctoralDegree
range includes: GeneralEducationDevelopment
range includes: GeneralEducationLevel1Certificate
range includes: GeneralEducationLevel2Certificate
range includes: HigherEducationLevel1Certificate
range includes: HigherEducationLevel2Certificate
range includes: Industry
range includes: Job
range includes: JourneymanCertificate
range includes: LearningOpportunityProfile
range includes: LearningProgram
range includes: License
range includes: MasterCertificate
range includes: MasterDegree
range includes: MasterOfArtsDegree
range includes: MasterOfScienceDegree
range includes: MicroCredential
range includes: Occupation
range includes: OpenBadge
range includes: Organization
range includes: Pathway
range includes: PostBaccalaureateCertificate
range includes: PostMasterCertificate
range includes: PreApprenticeshipCertificate
range includes: ProfessionalCertificate
range includes: ProfessionalDoctorate
range includes: ProficiencyCertificate
range includes: QACredentialOrganization
range includes: QualityAssuranceCredential
range includes: ResearchDoctorate
range includes: SecondaryEducationCertificate
range includes: SecondarySchoolDiploma
range includes: SpecialistDegree
range includes: TechnicalLevel1Certificate
range includes: TechnicalLevel2Certificate
range includes: TechnicalLevel3Certificate
range includes: WorkBasedLearningCertificate

Size of Data
type: Property
comment: Number of subjects from the population for which data was obtained to calculate the observed value.
usage note: For the number of subjects in the sample for which no data was available use sizeOfNoData, and for the total number of subjects available use sizeOfPopulation.
term status: unstable
change history: https://credreg.net/qdata/termhistory/qdata/sizeOfData/json
domain includes: Observation
range includes: integer

Size of No Data
type: Property
comment: Number of subjects in the sample for which no data was obtained.
description: This is relevant for surveys or other forms of data gathering where a bias may be introduced by non-response or similar omissions.
usage note: For the number of subjects for which data was available, use sizeOfData, and for the total number of subjects available use sizeOfPopulation.
term status: unstable
change history: https://credreg.net/qdata/termhistory/qdata/sizeOfNoData/json
domain includes: Observation
range includes: integer

Size of Population
type: Property
comment: The total number of subjects in the relevant population.
usage note: For the number of subjects for which data was available, use sizeOfData, and for the number of subjects for which no data was available, use sizeOfNoData.
term status: unstable
change history: https://credreg.net/qdata/termhistory/qdata/sizeOfPopulation/json
domain includes: Observation
range includes: integer

Standard Deviation
type: Property
comment: Standard deviation about the mean.
term status: unstable
change history: https://credreg.net/qdata/termhistory/qdata/standardDeviation/json
domain includes: Observation
range includes: float

Subject Excluded
type: Property
comment: Category of subject excluded from the data.
term status: stable
change history: https://credreg.net/qdata/termhistory/qdata/subjectExcluded/json
domain includes: Data Profile
range includes: Quantitative Value

Subject Identification
type: Property
comment: Identification of data point(s) in the data set that describe personal subject attribute(s) used to uniquely identify a subject for the purpose of matching records and an indication of level of confidence in the accuracy of the match.
term status: stable
change history: https://credreg.net/qdata/termhistory/qdata/subjectIdentification/json
domain includes: Data Set Profile
range includes: langString

Subjects In Set
type: Property
comment: Total credential holders and non-holders in the final data collection and reporting.
term status: stable
change history: https://credreg.net/qdata/termhistory/qdata/subjectsInSet/json
domain includes: Data Profile
range includes: Quantitative Value

Subject Type
type: Property
comment: Type of subject included or excluded from the data set.
term status: stable
change history: https://credreg.net/qdata/termhistory/qdata/subjectType/json
range includes: Concept
target scheme: Subject Category

Subject Value
type: Property
comment: Quantitative values and percentages for a subject category in the data set.
term status: stable
change history: https://credreg.net/qdata/termhistory/qdata/subjectValue/json
range includes: Quantitative Value

Sufficient Employment Criteria
type: Property
comment: Number of holders that meet the prescribed employment threshold in terms of earnings or time engaged in work as defined for the data set (employmentDefinition).
term status: stable
change history: https://credreg.net/qdata/termhistory/qdata/sufficientEmploymentCriteria/json
domain includes: Data Profile
range includes: Quantitative Value

Time Interval
type: Property
comment: Length of the interval between two events.
term status: unstable
change history: https://credreg.net/qdata/termhistory/qdata/timeInterval/json
domain includes: Data Set Time Frame
range includes: Duration

Total WIOA Completers
type: Property
comment: Total participants who completed the WIOA program, successfully or unsuccessfully.
term status: stable
change history: https://credreg.net/qdata/termhistory/qdata/totalWIOACompleters/json
domain includes: Data Profile
range includes: Quantitative Value

Total WIOA Exiters
type: Property
comment: Total participants who successfully completed the WIOA program and exited WIOA.
term status: stable
change history: https://credreg.net/qdata/termhistory/qdata/totalWIOAExiters/json
domain includes: Data Profile
range includes: Quantitative Value

Total WIOA Participants
type: Property
comment: Total participants in the WIOA program.
term status: stable
change history: https://credreg.net/qdata/termhistory/qdata/totalWIOAParticipants/json
domain includes: Data Profile
range includes: Quantitative Value

Unrelated Employment
type: Property
comment: Number of people employed outside the area of work (e.g., industry, occupation) in which the credential provided preparation.
term status: stable
change history: https://credreg.net/qdata/termhistory/qdata/unrelatedEmployment/json
domain includes: Data Profile
range includes: Quantitative Value

Work Time Threshold
type: Property
comment: Statement of earnings thresholds used in determining whether a sufficient level of workforce attachment has been achieved to qualify as employed during the chosen employment and earnings time period.
term status: stable
change history: https://credreg.net/qdata/termhistory/qdata/workTimeThreshold/json
domain includes: Data Profile
range includes: langString

About
type: Property
comment: Subject matter of the resource.
term status: stable
change history: https://credreg.net/qdata/termhistory/schema/about/json
domain includes: AlignmentMap
domain includes: Data Set Profile
range includes: Resource

Currency
type: Property
comment: Currency abbreviation (e.g., USD).
term status: stable
change history: https://credreg.net/qdata/termhistory/schema/currency/json
domain includes: Observation
domain includes: Monetary Amount
domain includes: Monetary Amount Distribution
range includes: string

Description
type: Property
comment: A description of the item.
term status: stable
change history: https://credreg.net/qdata/termhistory/schema/description/json
domain includes: ValueProfile
domain includes: Monetary Amount
domain includes: Quantitative Value
range includes: langString

Maximum Value
type: Property
comment: The upper value of some characteristic or property.
usage note: In CTDL: for single values, use schema:value; for ranges, use schema:minValue and schema:maxValue.
term status: stable
change history: https://credreg.net/qdata/termhistory/schema/maxValue/json
domain includes: CriterionLevel
domain includes: PayProfile
domain includes: ValueProfile
domain includes: Observation
domain includes: Monetary Amount
domain includes: Quantitative Value
range includes: float

Minimum Value
type: Property
comment: The lower value of some characteristic or property.
usage note: In CTDL: for single values, use schema:value; for ranges, use schema:minValue and schema:maxValue.
term status: stable
change history: https://credreg.net/qdata/termhistory/schema/minValue/json
domain includes: CriterionLevel
domain includes: PayProfile
domain includes: ValueProfile
domain includes: Observation
domain includes: Monetary Amount
domain includes: Quantitative Value
range includes: float

Unit Text
type: Property
comment: A string or text indicating the unit of measurement.
term status: stable
change history: https://credreg.net/qdata/termhistory/schema/unitText/json
domain includes: Monetary Amount
domain includes: Quantitative Value
range includes: CredentialAlignmentObject
range includes: Concept

Value
type: Property
comment: The value of the property value node.
usage note: In CTDL: for single values, use schema:value; for ranges, use schema:minValue and schema:maxValue.
term status: stable
change history: https://credreg.net/qdata/termhistory/schema/value/json
domain includes: CriterionLevel
domain includes: PayProfile
domain includes: ValueProfile
domain includes: Observation
domain includes: Monetary Amount
domain includes: Quantitative Value
range includes: float

Administrative Record Category
type: ConceptScheme
comment: Categories of administrative records.
term status: stable
change history: https://credreg.net/qdata/termhistory/qdata/AdministrativeRecordCategory/json
has concept: United States 1099 Tax Document
has concept: United States W-2 Tax Document
has concept: Unemployment Insurance
has top concept: United States 1099 Tax Document
has top concept: United States W-2 Tax Document
has top concept: Unemployment Insurance

Collection Method
type: ConceptScheme
comment: Categories of methods for collecting data.
term status: stable
change history: https://credreg.net/qdata/termhistory/qdata/CollectionMethod/json
has concept: Administrative Record Matching
has concept: Credential Holder Reporting
has concept: Credential Holder Survey
has concept: Supplemental Method
has concept: Supplemental Source
has top concept: Administrative Record Matching
has top concept: Credential Holder Reporting
has top concept: Credential Holder Survey
has top concept: Supplemental Method
has top concept: Supplemental Source

Data Source Coverage
type: ConceptScheme
comment: Categories of geographic coverage.
term status: stable
change history: https://credreg.net/qdata/termhistory/qdata/DataSourceCoverage/json
has concept: Country
has concept: Global
has concept: Region
has concept: State Or Province
has concept: Urban Area
has top concept: Country
has top concept: Global
has top concept: Region
has top concept: State Or Province
has top concept: Urban Area

Data Withholding Category
type: ConceptScheme
comment: Categories of processes for withholding data in a data set.
term status: stable
change history: https://credreg.net/qdata/termhistory/qdata/DataWithholdingCategory/json
has concept: Data Masked
has concept: Data Suppressed
has top concept: Data Masked
has top concept: Data Suppressed

Demographic Category
type: ConceptScheme
comment: Classification of various means (such as classification schemes) used to describe and categorize subjects in a population.
term status: unstable
change history: https://credreg.net/qdata/termhistory/qdata/DemographicCategory/json
has concept: Accommodation
has concept: Age
has concept: Benefits
has concept: Dependency Responsibility
has concept: Disability
has concept: Education Level
has concept: Employment
has concept: Ethnicity
has concept: Family Educational Background
has concept: Gender
has concept: Housing
has concept: Income
has concept: Language
has concept: Literacy
has concept: Marital Status
has concept: Military Status
has concept: Race
has concept: Residency
has concept: Skills
has top concept: Accommodation
has top concept: Age
has top concept: Benefits
has top concept: Dependency Responsibility
has top concept: Disability
has top concept: Education Level
has top concept: Employment
has top concept: Ethnicity
has top concept: Family Educational Background
has top concept: Gender
has top concept: Housing
has top concept: Income
has top concept: Language
has top concept: Literacy
has top concept: Marital Status
has top concept: Military Status
has top concept: Race
has top concept: Residency
has top concept: Skills

Income Determination Method
type: ConceptScheme
comment: Methods for determining the actual or anticipated annual earnings of the subjects in the data set.
term status: stable
change history: https://credreg.net/qdata/termhistory/qdata/IncomeDeterminationMethod/json
has concept: Actual Earnings
has concept: Annualized Earnings
has top concept: Actual Earnings
has top concept: Annualized Earnings

Metric Category
type: ConceptScheme
comment: Types of metrics applicable to an Observation.
term status: unstable
change history: https://credreg.net/qdata/termhistory/qdata/MetricCategory/json
has concept: Acceptance
has concept: Access
has concept: Activity and Earnings
has concept: Benefits Received
has concept: Career Advancement
has concept: Completion
has concept: Concentrator
has concept: Cost and Duration
has concept: Credential
has concept: Credential Attainment
has concept: Credential Awarded
has concept: Credential Types Offered
has concept: Credential Value
has concept: Credit Transfer
has concept: Direct Cost
has concept: Earnings
has concept: Education Level
has concept: Employer Satisfaction
has concept: Employment
has concept: Enrollment
has concept: High-Skill Occupation
has concept: High Wage Occupation
has concept: In-demand Occupation
has concept: Industry Employment
has concept: Industry Growth
has concept: Innovation Adoption
has concept: Job, Industry and Occupation
has concept: Job Openings
has concept: Learner to Advisor
has concept: Learner to Faculty
has concept: Occupation Employment
has concept: Occupation Growth
has concept: Organization
has concept: Total Cost of Participation
has concept: Participation and Engagement
has concept: Pass Rate
has concept: Performance
has concept: Placement
has concept: Post-Completion
has concept: Post-Enrollment
has concept: Pre-Enrollment
has concept: Education and Work Preparation Cost
has concept: Education and Work Preparation Duration
has concept: Prior Learning
has concept: Progression
has concept: Projected
has concept: Re-Enrollment
has concept: Retention
has concept: Retention and Completion
has concept: Skills Proficiency
has concept: Student Loan Subject
has concept: Student Financial
has concept: Student Financial Assistance
has concept: Student Loan Amount
has concept: Student Loan Debt
has concept: Student Satisfaction
has concept: Support
has concept: Technology and Innovation
has concept: Time To Employment
has concept: Transfer Value
has concept: Use of Technology
has concept: WIOA
has concept: WIOA Completer
has concept: WIOA Participant
has concept: WIOA Program Exiter
has concept: WIOA Training Exiter
has top concept: Activity and Earnings
has top concept: Cost and Duration
has top concept: Job, Industry and Occupation
has top concept: Organization
has top concept: Participation and Engagement
has top concept: Performance
has top concept: Post-Completion
has top concept: Post-Enrollment
has top concept: Pre-Enrollment

Subject Category
type: ConceptScheme
comment: Categories of subjects for employment and earnings data.
term status: stable
change history: https://credreg.net/qdata/termhistory/qdata/SubjectCategory/json
has concept: Assessment Completer
has concept: Credential Holder
has concept: Credential Seeker
has concept: Enrollee
has concept: Financial Aid Recipient
has concept: Graduate
has concept: Higher Level Credential
has concept: In Further Education
has concept: Insufficient Data Available
has concept: Post-Credential Earnings
has concept: Pre-Credential Earnings
has top concept: Assessment Completer
has top concept: Credential Holder
has top concept: Credential Seeker
has top concept: Enrollee
has top concept: Financial Aid Recipient
has top concept: Graduate
has top concept: Higher Level Credential
has top concept: In Further Education
has top concept: Insufficient Data Available
has top concept: Post-Credential Earnings
has top concept: Pre-Credential Earnings

United States 1099 Tax Document
type: Concept
definition: United States Federal tax form that an entity or person other than an employer provides stating earnings paid an individual.
term status: stable
change history: https://credreg.net/qdata/termhistory/adminRecord/Tax1099/json
in scheme: Administrative Record Category
top concept of: Administrative Record Category

United States W-2 Tax Document
type: Concept
definition: United States Official Wage and Tax Statement that reports an employee's annual wages and the amount of taxes withheld from their paycheck by an employer.
term status: stable
change history: https://credreg.net/qdata/termhistory/adminRecord/TaxW2/json
in scheme: Administrative Record Category
top concept of: Administrative Record Category

Unemployment Insurance
type: Concept
definition: Contain the earnings reported by employers (typically on a quarterly basis) to state unemployment insurance agencies for each employee.
term status: stable
change history: https://credreg.net/qdata/termhistory/adminRecord/UnemploymentInsurance/json
in scheme: Administrative Record Category
top concept of: Administrative Record Category

Administrative Record Matching
type: Concept
definition: Data derived from cross-mapping unambiguous identifiers from more than one government administrative data sets.
term status: stable
change history: https://credreg.net/qdata/termhistory/collectionMethod/AdministrativeRecordMatching/json
in scheme: Collection Method
top concept of: Collection Method

Credential Holder Reporting
type: Concept
definition: Data derived through credential holder self-reporting.
term status: stable
change history: https://credreg.net/qdata/termhistory/collectionMethod/CredentialHolderReporting/json
in scheme: Collection Method
top concept of: Collection Method

Credential Holder Survey
type: Concept
definition: Data derived through surveying holders.
term status: stable
change history: https://credreg.net/qdata/termhistory/collectionMethod/CredentialHolderSurvey/json
in scheme: Collection Method
top concept of: Collection Method

Supplemental Method
type: Concept
definition: Additional method used to augment administrative, self-reported or survey data.
term status: stable
change history: https://credreg.net/qdata/termhistory/collectionMethod/SupplementalMethod/json
in scheme: Collection Method
top concept of: Collection Method

Supplemental Source
type: Concept
definition: Agent providing data augmenting administrative, self-reported or survey data.
term status: stable
change history: https://credreg.net/qdata/termhistory/collectionMethod/SupplementalSource/json
in scheme: Collection Method
top concept of: Collection Method

Data Masked
type: Concept
definition: Select information concealed or encrypted to protect the identities of subjects.
term status: stable
change history: https://credreg.net/qdata/termhistory/dataWithholding/DataMasked/json
in scheme: Data Withholding Category
top concept of: Data Withholding Category

Data Suppressed
type: Concept
definition: Select information withheld or removed to protect the identities of subjects.
term status: stable
change history: https://credreg.net/qdata/termhistory/dataWithholding/DataSuppressed/json
in scheme: Data Withholding Category
top concept of: Data Withholding Category

Accommodation
type: Concept
definition: Means of indicating the subjects' use of services or resources for equal access.
term status: unstable
change history: https://credreg.net/qdata/termhistory/demoCat/Accommodation/json
in scheme: Demographic Category
top concept of: Demographic Category

Age
type: Concept
definition: Means of indicating the age of subjects, typically categorized into age groups.
term status: unstable
change history: https://credreg.net/qdata/termhistory/demoCat/Age/json
in scheme: Demographic Category
top concept of: Demographic Category

Benefits
type: Concept
definition: Means of indicating whether subjects receive public or other benefits.
term status: unstable
change history: https://credreg.net/qdata/termhistory/demoCat/Benefits/json
in scheme: Demographic Category
top concept of: Demographic Category

Dependency Responsibility
type: Concept
definition: Means of indicating the caring responsibilities of subjects, such as for dependents or other family members.
term status: unstable
change history: https://credreg.net/qdata/termhistory/demoCat/DependencyResponsibility/json
in scheme: Demographic Category
top concept of: Demographic Category

Disability
type: Concept
definition: Means of indicating whether subjects have a disability, including physical, sensory, cognitive, mental health, or learning disabilities, recognizing both visible and invisible disabilities.
term status: unstable
change history: https://credreg.net/qdata/termhistory/demoCat/Disability/json
in scheme: Demographic Category
top concept of: Demographic Category

Education Level
type: Concept
definition: Means of indicating the highest level of education completed by subjects.
term status: unstable
change history: https://credreg.net/qdata/termhistory/demoCat/EducationLevel/json
related match: Education Level
in scheme: Demographic Category
top concept of: Demographic Category

Employment
type: Concept
definition: Means of indicating the employment status of subjects.
term status: unstable
change history: https://credreg.net/qdata/termhistory/demoCat/Employment/json
related match: Employment
in scheme: Demographic Category
top concept of: Demographic Category

Ethnicity
type: Concept
definition: Means of indicating the ethnicity of subjects, reflecting their cultural identity.
term status: unstable
change history: https://credreg.net/qdata/termhistory/demoCat/Ethnicity/json
in scheme: Demographic Category
top concept of: Demographic Category

Family Educational Background
type: Concept
definition: Means of indicating the educational background of a subject's family, for example whether subjects are the first in their family to attend higher education institutions.
term status: unstable
change history: https://credreg.net/qdata/termhistory/demoCat/FamilyEducationalBackground/json
in scheme: Demographic Category
top concept of: Demographic Category

Gender
type: Concept
definition: Means of indicating the gender identity of subjects, which can include male, female, and other gender identities.
term status: unstable
change history: https://credreg.net/qdata/termhistory/demoCat/Gender/json
in scheme: Demographic Category
top concept of: Demographic Category

Housing
type: Concept
definition: Means of indicating whether subjects are housed or experiencing housing instability.
term status: unstable
change history: https://credreg.net/qdata/termhistory/demoCat/Housing/json
in scheme: Demographic Category
top concept of: Demographic Category

Income
type: Concept
definition: Means of indicating the financial stability of subjects.
term status: unstable
change history: https://credreg.net/qdata/termhistory/demoCat/Income/json
related match: Earnings
in scheme: Demographic Category
top concept of: Demographic Category

Language
type: Concept
definition: Means of indicating the primary language spoken by subjects.
term status: unstable
change history: https://credreg.net/qdata/termhistory/demoCat/Language/json
in scheme: Demographic Category
top concept of: Demographic Category

Literacy
type: Concept
definition: Means of indicating the literacy level of subjects, including reading and writing skills.
term status: unstable
change history: https://credreg.net/qdata/termhistory/demoCat/Literacy/json
in scheme: Demographic Category
top concept of: Demographic Category

Marital Status
type: Concept
definition: Means of indicating the marital status of subjects.
term status: unstable
change history: https://credreg.net/qdata/termhistory/demoCat/MaritalStatus/json
in scheme: Demographic Category
top concept of: Demographic Category

Military Status
type: Concept
definition: Means of indicating the status of being associated with military service, either personally or through family.
term status: unstable
change history: https://credreg.net/qdata/termhistory/demoCat/MilitaryStatus/json
in scheme: Demographic Category
top concept of: Demographic Category

Race
type: Concept
definition: Means of indicating the race / ethnicity of subjects, categorized according to widely recognized standards.
term status: unstable
change history: https://credreg.net/qdata/termhistory/demoCat/Race/json
in scheme: Demographic Category
top concept of: Demographic Category

Residency
type: Concept
definition: Means of indicating where subjects live.
term status: unstable
change history: https://credreg.net/qdata/termhistory/demoCat/Residency/json
in scheme: Demographic Category
top concept of: Demographic Category

Skills
type: Concept
definition: Means of indicating the type or nature of skills acquired by subjects, including both hard and soft skills.
term status: unstable
change history: https://credreg.net/qdata/termhistory/demoCat/Skills/json
related match: Skills Proficiency
in scheme: Demographic Category
top concept of: Demographic Category

Actual Earnings
type: Concept
definition: Earnings garnered over the entire reported time period of the data set.
term status: stable
change history: https://credreg.net/qdata/termhistory/incomeDetermination/ActualEarnings/json
in scheme: Income Determination Method
top concept of: Income Determination Method

Annualized Earnings
type: Concept
definition: Calculated annual earnings based on reported earnings for a stated period shorter than the reported time period of the data set.
term status: stable
change history: https://credreg.net/qdata/termhistory/incomeDetermination/AnnualizedEarnings/json
in scheme: Income Determination Method
top concept of: Income Determination Method

Acceptance
type: Concept
definition: Measurement of subjects who are admitted to an organization or its educational or work preparation activity or resource after completing the application process.
term status: unstable
change history: https://credreg.net/qdata/termhistory/metricCat/Acceptance/json
broader: Participation and Engagement
in scheme: Metric Category

Access
type: Concept
definition: Measurement of subjects who access educational or work activities or resources.
term status: unstable
change history: https://credreg.net/qdata/termhistory/metricCat/Access/json
broader: Participation and Engagement
in scheme: Metric Category

Activity and Earnings
type: Concept
definition: Measurement of subjects' activity and employment status, income, wages, salaries, time to secure employment, and related rates.
term status: unstable
change history: https://credreg.net/qdata/termhistory/metricCat/ActivityEarnings/json
in scheme: Metric Category
top concept of: Metric Category
narrower: Career Advancement
narrower: Earnings
narrower: Employment
narrower: Time To Employment

Benefits Received
type: Concept
definition: Measurement of the benefits received by subjects.
term status: unstable
change history: https://credreg.net/qdata/termhistory/metricCat/BenefitsReceived/json
broader: Organization
in scheme: Metric Category

Career Advancement
type: Concept
definition: Measurement of the impact of educational or work preparation activities or resources on subjects' career advancement opportunities.
term status: unstable
change history: https://credreg.net/qdata/termhistory/metricCat/CareerAdvancement/json
broader: Activity and Earnings
in scheme: Metric Category

Completion
type: Concept
definition: Measurement of subjects who do or don't meet completion requirements for a specified education or work activity or resource.
term status: unstable
change history: https://credreg.net/qdata/termhistory/metricCat/Completion/json
broader: Retention and Completion
in scheme: Metric Category

Concentrator
type: Concept
definition: Measurement of subjects within a single educational program who meet completion requirements related to a specific workforce preparation program of study.
term status: unstable
change history: https://credreg.net/qdata/termhistory/metricCat/Concentrator/json
broader: Performance
in scheme: Metric Category

Cost and Duration
type: Concept
definition: Measurement of the financial costs and time required for subjects to participate in and complete educational or work preparation activities or resources.
term status: unstable
change history: https://credreg.net/qdata/termhistory/metricCat/CostDuration/json
in scheme: Metric Category
top concept of: Metric Category
narrower: Direct Cost
narrower: Total Cost of Participation
narrower: Education and Work Preparation Cost
narrower: Education and Work Preparation Duration

Credential
type: Concept
definition: Measurement of the awarding, offering, and value of credentials obtained by subjects in educational or work preparation programs.
term status: unstable
change history: https://credreg.net/qdata/termhistory/metricCat/Credential/json
broader: Organization
in scheme: Metric Category
narrower: Credential Awarded
narrower: Credential Types Offered
narrower: Credential Value

Credential Attainment
type: Concept
definition: Measurement of subjects who do or don't attain a credential.
term status: unstable
change history: https://credreg.net/qdata/termhistory/metricCat/CredentialAttainment/json
broader: Retention and Completion
in scheme: Metric Category

Credential Awarded
type: Concept
definition: Measurement of individual credentials awarded to subjects.
term status: unstable
change history: https://credreg.net/qdata/termhistory/metricCat/CredentialAwarded/json
broader: Credential
in scheme: Metric Category

Credential Types Offered
type: Concept
definition: Measurement of the types of credential available for award.
term status: unstable
change history: https://credreg.net/qdata/termhistory/metricCat/CredentialTypesOffered/json
broader: Credential
in scheme: Metric Category

Credential Value
type: Concept
definition: Measurement of the value of credentials available or awarded to subjects.
term status: unstable
change history: https://credreg.net/qdata/termhistory/metricCat/CredentialValue/json
broader: Credential
in scheme: Metric Category

Credit Transfer
type: Concept
definition: Measurement of credits earned prior to enrollment transferred to another educational program.
term status: unstable
change history: https://credreg.net/qdata/termhistory/metricCat/CreditTransfer/json
broader: Participation and Engagement
related match: Prior Learning
in scheme: Metric Category

Direct Cost
type: Concept
definition: Measurement of costs charged for subjects to participate in an organization or an educational or work preparation activity or resource.
term status: unstable
change history: https://credreg.net/qdata/termhistory/metricCat/DirectCost/json
broader: Cost and Duration
in scheme: Metric Category

Earnings
type: Concept
definition: Measurement of the income subjects receive from all forms of work.
term status: unstable
change history: https://credreg.net/qdata/termhistory/metricCat/Earnings/json
broader: Activity and Earnings
related match: Income
in scheme: Metric Category

Education Level
type: Concept
definition: Measurement of subjects' highest level of education achieved.
term status: unstable
change history: https://credreg.net/qdata/termhistory/metricCat/EducationLevel/json
broader: Retention and Completion
related match: Education Level
in scheme: Metric Category

Employer Satisfaction
type: Concept
definition: Measurement of the satisfaction of employers with the performance of subjects from educational or work preparation activity or resource.
term status: unstable
change history: https://credreg.net/qdata/termhistory/metricCat/EmployerSatisfaction/json
broader: Performance
in scheme: Metric Category

Employment
type: Concept
definition: Measurement of the status of subjects being engaged with paid work.
term status: unstable
change history: https://credreg.net/qdata/termhistory/metricCat/Employment/json
broader: Activity and Earnings
related match: Employment
in scheme: Metric Category

Enrollment
type: Concept
definition: Measurement of subjects who enroll in an organization or its specified education or work preparation activity or resource.
term status: unstable
change history: https://credreg.net/qdata/termhistory/metricCat/Enrollment/json
broader: Participation and Engagement
in scheme: Metric Category

High-Skill Occupation
type: Concept
definition: Measurement of the number of subjects employed in a high-skill occupation.
term status: unstable
change history: https://credreg.net/qdata/termhistory/metricCat/HighSkillOccupation/json
broader: Job, Industry and Occupation
in scheme: Metric Category

High Wage Occupation
type: Concept
definition: Measurement of the number of subjects employed in a high-wage occupation.
term status: unstable
change history: https://credreg.net/qdata/termhistory/metricCat/HighWageOccupation/json
broader: Job, Industry and Occupation
in scheme: Metric Category

In-demand Occupation
type: Concept
definition: Measurement of the number of subjects employed in a high-demand occupation.
term status: unstable
change history: https://credreg.net/qdata/termhistory/metricCat/InDemandOccupation/json
broader: Job, Industry and Occupation
in scheme: Metric Category

Industry Employment
type: Concept
definition: Measurement of the number of subjects employed within an industry.
term status: unstable
change history: https://credreg.net/qdata/termhistory/metricCat/IndustryEmployment/json
broader: Job, Industry and Occupation
in scheme: Metric Category

Industry Growth
type: Concept
definition: Measurement of the growth rate of an industry.
term status: unstable
change history: https://credreg.net/qdata/termhistory/metricCat/IndustryGrowth/json
broader: Job, Industry and Occupation
in scheme: Metric Category

Innovation Adoption
type: Concept
definition: Measurement of the rate at which new and innovative practices are adopted in educational or work activities or resources.
term status: unstable
change history: https://credreg.net/qdata/termhistory/metricCat/InnovationAdoption/json
broader: Technology and Innovation
in scheme: Metric Category

Job, Industry and Occupation
type: Concept
definition: Measurement of employment and earnings in industries or occupational areas.
term status: unstable
change history: https://credreg.net/qdata/termhistory/metricCat/JobIndustryOccupation/json
in scheme: Metric Category
top concept of: Metric Category
narrower: High-Skill Occupation
narrower: High Wage Occupation
narrower: In-demand Occupation
narrower: Industry Employment
narrower: Industry Growth
narrower: Job Openings
narrower: Occupation Employment
narrower: Occupation Growth

Job Openings
type: Concept
definition: Measurement of the number of job openings.
term status: unstable
change history: https://credreg.net/qdata/termhistory/metricCat/JobOpenings/json
broader: Job, Industry and Occupation
in scheme: Metric Category

Learner to Advisor
type: Concept
definition: Measurement of the number of learners per available advisor.
term status: unstable
change history: https://credreg.net/qdata/termhistory/metricCat/LearnerToAdvisor/json
broader: Organization
in scheme: Metric Category

Learner to Faculty
type: Concept
definition: Measurement of the number of learners per available faculty.
term status: unstable
change history: https://credreg.net/qdata/termhistory/metricCat/LearnerToFaculty/json
broader: Organization
in scheme: Metric Category

Occupation Employment
type: Concept
definition: Measurement of the number of subjects employed in an occupational area.
term status: unstable
change history: https://credreg.net/qdata/termhistory/metricCat/OccupationEmployment/json
broader: Job, Industry and Occupation
in scheme: Metric Category

Occupation Growth
type: Concept
definition: Measure the growth rate of an occupational area.
term status: unstable
change history: https://credreg.net/qdata/termhistory/metricCat/OccupationGrowth/json
broader: Job, Industry and Occupation
in scheme: Metric Category

Organization
type: Concept
definition: Measurement of organizational support, advisor and faculty availability, benefits received by subjects, and the acceptance of prior learning.
term status: unstable
change history: https://credreg.net/qdata/termhistory/metricCat/Organization/json
in scheme: Metric Category
top concept of: Metric Category
narrower: Benefits Received
narrower: Credential
narrower: Learner to Advisor
narrower: Learner to Faculty
narrower: Support
narrower: Transfer Value

Total Cost of Participation
type: Concept
definition: Measurement of all costs incurred directly or indirectly by a subject as a result of participation in an organization or an educational or work preparation activity or resource.
term status: unstable
change history: https://credreg.net/qdata/termhistory/metricCat/ParticipationCost/json
broader: Cost and Duration
in scheme: Metric Category

Participation and Engagement
type: Concept
definition: Measurement of subjects' active involvement, admission, enrollment, and re-enrollment in specified education or work preparation activities or resources.
term status: unstable
change history: https://credreg.net/qdata/termhistory/metricCat/ParticipationEngagement/json
in scheme: Metric Category
top concept of: Metric Category
narrower: Acceptance
narrower: Access
narrower: Credit Transfer
narrower: Enrollment
narrower: Prior Learning
narrower: Re-Enrollment

Pass Rate
type: Concept
definition: Measurement of the proportion of subjects who have passed the relevant program, education, or workforce preparation activity or resource.
term status: unstable
change history: https://credreg.net/qdata/termhistory/metricCat/PassRate/json
broader: Retention and Completion
in scheme: Metric Category

Performance
type: Concept
definition: Measurement of subjects' achievement, including completion requirements, proficiency, placement in work or further education, and measurable skills gains in educational or work preparation activities or resources.
term status: unstable
change history: https://credreg.net/qdata/termhistory/metricCat/Performance/json
in scheme: Metric Category
top concept of: Metric Category
narrower: Concentrator
narrower: Employer Satisfaction
narrower: Placement
narrower: Skills Proficiency
narrower: Student Satisfaction

Placement
type: Concept
definition: Measurement of subjects who advance from an education or work preparation activity to work, military, or a higher-level program.
term status: unstable
change history: https://credreg.net/qdata/termhistory/metricCat/Placement/json
broader: Performance
in scheme: Metric Category

Post-Completion
type: Concept
definition: Measurement made after subjects have completed an activity or resource.
usage note: Use with another metric category that classifies what is being measured.
term status: unstable
change history: https://credreg.net/qdata/termhistory/metricCat/PostCompletion/json
in scheme: Metric Category
top concept of: Metric Category

Post-Enrollment
type: Concept
definition: Measurement made after subjects have enrolled for an activity or resource.
usage note: Use with another metric category that classifies what is being measured. Use metriCat:PostCompletion for measurements made after completions.
term status: unstable
change history: https://credreg.net/qdata/termhistory/metricCat/PostEnrollment/json
in scheme: Metric Category
top concept of: Metric Category

Pre-Enrollment
type: Concept
definition: Measurement made before subjects have enrolled for an activity or resource.
usage note: Use with another metric category that classifies what is being measured.
term status: unstable
change history: https://credreg.net/qdata/termhistory/metricCat/PreEnrollment/json
in scheme: Metric Category
top concept of: Metric Category

Education and Work Preparation Cost
type: Concept
definition: Measurement of the cost for a subject to participate in an organization or an educational or work preparation activity or resource.
term status: unstable
change history: https://credreg.net/qdata/termhistory/metricCat/PreparationCost/json
broader: Cost and Duration
in scheme: Metric Category

Education and Work Preparation Duration
type: Concept
definition: Measurement of the period of time to complete an educational or work preparation activity or resource.
term status: unstable
change history: https://credreg.net/qdata/termhistory/metricCat/PreparationDuration/json
broader: Cost and Duration
in scheme: Metric Category

Prior Learning
type: Concept
definition: Measurement of the recognition and assessment of subjects' existing knowledge and skills to potentially fulfill certain requirements for a work preparation activity or resource.
term status: unstable
change history: https://credreg.net/qdata/termhistory/metricCat/PriorLearning/json
broader: Participation and Engagement
related match: Credit Transfer
in scheme: Metric Category

Progression
type: Concept
definition: Measurement of subjects who progress in a particular organization or its educational or work preparation activity or resource.
term status: unstable
change history: https://credreg.net/qdata/termhistory/metricCat/Progression/json
broader: Retention and Completion
in scheme: Metric Category

Projected
type: Concept
definition: Measurement of data that is predicted to be true in the future.
usage note: Intended for use with other metric category types to indicate that the values for this metric are predictions or extrapolations, rather than current measured data.
term status: unstable
change history: https://credreg.net/qdata/termhistory/metricCat/Projected/json
in scheme: Metric Category
top concept of: Metric Category

Re-Enrollment
type: Concept
definition: Measurement of eligible subjects who re-enroll in an organization or its specified education or work activity or resource.
term status: unstable
change history: https://credreg.net/qdata/termhistory/metricCat/ReEnrollment/json
broader: Participation and Engagement
in scheme: Metric Category

Retention
type: Concept
definition: Measurement of subjects who continue or persist in a particular organization or its educational or work preparation activity or resource.
term status: unstable
change history: https://credreg.net/qdata/termhistory/metricCat/Retention/json
broader: Retention and Completion
in scheme: Metric Category

Retention and Completion
type: Concept
definition: Measurement of subjects' persistence, discontinuation, completion, credential attainment, and highest level of education achieved in educational or work activities or resources.
term status: unstable
change history: https://credreg.net/qdata/termhistory/metricCat/RetentionCompletion/json
in scheme: Metric Category
top concept of: Metric Category
narrower: Completion
narrower: Credential Attainment
narrower: Education Level
narrower: Pass Rate
narrower: Progression
narrower: Retention

Skills Proficiency
type: Concept
definition: Measurement of subjects' proficiency within an educational or work preparation activity or resource.
term status: unstable
change history: https://credreg.net/qdata/termhistory/metricCat/SkillsProficiency/json
broader: Performance
related match: Skills
in scheme: Metric Category

Student Loan Subject
type: Concept
definition: Measurement of the percentage of subjects with loans.
term status: unstable
change history: https://credreg.net/qdata/termhistory/metricCat/StudenLoanSubject/json
broader: Student Financial
in scheme: Metric Category

Student Financial
type: Concept
definition: Measurement of financial assistance, student funding sources, and various aspects of student loans and debt related to educational or work preparation activities or resources.
term status: unstable
change history: https://credreg.net/qdata/termhistory/metricCat/StudentFinancial/json
in scheme: Metric Category
top concept of: Metric Category
narrower: Student Loan Subject
narrower: Student Financial Assistance
narrower: Student Loan Amount
narrower: Student Loan Debt

Student Financial Assistance
type: Concept
definition: Measurement of the financial aid provided to subjects, including grants, scholarships, loans, and other financial support.
term status: unstable
change history: https://credreg.net/qdata/termhistory/metricCat/StudentFinancialAssistance/json
broader: Student Financial
in scheme: Metric Category

Student Loan Amount
type: Concept
definition: Measurement of the loan amount accumulated by subjects after completing a learning or workforce preparation program.
term status: unstable
change history: https://credreg.net/qdata/termhistory/metricCat/StudentLoanAmount/json
broader: Student Financial
in scheme: Metric Category

Student Loan Debt
type: Concept
definition: Measurement of the loan debt incurred by subjects for the purpose of enrolling in and participating in an educational or work preparation activity or resource.
term status: unstable
change history: https://credreg.net/qdata/termhistory/metricCat/StudentLoanDebt/json
broader: Student Financial
in scheme: Metric Category

Student Satisfaction
type: Concept
definition: Measurement of the level of satisfaction subjects have with their educational or work preparation programs.
term status: unstable
change history: https://credreg.net/qdata/termhistory/metricCat/StudentSatisfaction/json
broader: Performance
in scheme: Metric Category

Support
type: Concept
definition: Measurement of the support offered by the resource available for subjects.
term status: unstable
change history: https://credreg.net/qdata/termhistory/metricCat/Support/json
broader: Organization
in scheme: Metric Category

Technology and Innovation
type: Concept
definition: Measurement of the integration and adoption of technology and innovative practices in educational or work preparation activities or resources.
term status: unstable
change history: https://credreg.net/qdata/termhistory/metricCat/TechnologyInnovation/json
in scheme: Metric Category
top concept of: Metric Category
narrower: Innovation Adoption
narrower: Use of Technology

Time To Employment
type: Concept
definition: Measurement of the duration between subjects completing an educational or training program to secure paid work.
term status: unstable
change history: https://credreg.net/qdata/termhistory/metricCat/TimeToEmployment/json
broader: Activity and Earnings
in scheme: Metric Category

Transfer Value
type: Concept
definition: Measurement of the acceptance rate of subjects' prior learning towards an educational or work preparation activity or resource.
term status: unstable
change history: https://credreg.net/qdata/termhistory/metricCat/TransferValue/json
broader: Organization
in scheme: Metric Category

Use of Technology
type: Concept
definition: Measurement of the extent to which educational or work preparation activities or resources integrate technology in their delivery.
term status: unstable
change history: https://credreg.net/qdata/termhistory/metricCat/UseOfTechnology/json
broader: Technology and Innovation
in scheme: Metric Category

WIOA
type: Concept
definition: Measurement of subjects related to Workforce Innovation Opportunity Act services and sponsored education or workforce preparation activity or resource.
term status: unstable
change history: https://credreg.net/qdata/termhistory/metricCat/WIOA/json
in scheme: Metric Category
top concept of: Metric Category
narrower: WIOA Completer
narrower: WIOA Participant
narrower: WIOA Program Exiter
narrower: WIOA Training Exiter

WIOA Completer
type: Concept
definition: Measurement of subjects who completed a WIOA-sponsored education or workforce preparation activity or resource, regardless of whether they were successful or unsuccessful.
term status: unstable
change history: https://credreg.net/qdata/termhistory/metricCat/WIOACompleter/json
broader: WIOA
in scheme: Metric Category

WIOA Participant
type: Concept
definition: Measurement of subjects who have received staff-assisted Workforce Innovation Opportunity Act services.
term status: unstable
change history: https://credreg.net/qdata/termhistory/metricCat/WIOAParticipant/json
broader: WIOA
in scheme: Metric Category

WIOA Program Exiter
type: Concept
definition: Measurement of subjects who have received WIOA services and have an exit date or have not received any reportable services in the last 90 days.
term status: unstable
change history: https://credreg.net/qdata/termhistory/metricCat/WIOAProgramExiter/json
broader: WIOA
in scheme: Metric Category

WIOA Training Exiter
type: Concept
definition: Measures of subjects who either completed or withdrew from a WIOA-sponsored training program, or transferred to a different program.
term status: unstable
change history: https://credreg.net/qdata/termhistory/metricCat/WIOATrainingExiter/json
broader: WIOA
in scheme: Metric Category

Country
type: Concept
definition: Nation with its own government, occupying a particular territory such as the United States of America, Germany and France.
term status: stable
change history: https://credreg.net/qdata/termhistory/sourceCoverage/Country/json
in scheme: Data Source Coverage
top concept of: Data Source Coverage

Global
type: Concept
definition: Encompassing the entire world.
term status: stable
change history: https://credreg.net/qdata/termhistory/sourceCoverage/Global/json
in scheme: Data Source Coverage
top concept of: Data Source Coverage

Region
type: Concept
definition: Non-governmental, named geographic area, such as Silicon Valley, that is not necessarily coincident with the boundaries of a country or administrative subdivision thereof.
term status: stable
change history: https://credreg.net/qdata/termhistory/sourceCoverage/Region/json
in scheme: Data Source Coverage
top concept of: Data Source Coverage

State Or Province
type: Concept
definition: Principal administrative and occasionally sovereign subdivision of a country such as California, Bavaria, and Yucatan.
term status: stable
change history: https://credreg.net/qdata/termhistory/sourceCoverage/StateOrProvince/json
in scheme: Data Source Coverage
top concept of: Data Source Coverage

Urban Area
type: Concept
definition: Urban area that has a name, defined boundaries, and local government such as a city, town, or village.
term status: stable
change history: https://credreg.net/qdata/termhistory/sourceCoverage/UrbanArea/json
in scheme: Data Source Coverage
top concept of: Data Source Coverage

Assessment Completer
type: Concept
definition: Subject that has successfully completed an assessment.
term status: stable
change history: https://credreg.net/qdata/termhistory/subjectCategory/AssessmentCompleter/json
in scheme: Subject Category
top concept of: Subject Category

Credential Holder
type: Concept
definition: Subject that has earned the credential during the chosen employment and earnings time period.
term status: stable
change history: https://credreg.net/qdata/termhistory/subjectCategory/CredentialHolder/json
in scheme: Subject Category
top concept of: Subject Category

Credential Seeker
type: Concept
definition: Subject actively seeking the credential through enrollment in a program or taking an assessment.
term status: stable
change history: https://credreg.net/qdata/termhistory/subjectCategory/CredentialSeeker/json
in scheme: Subject Category
top concept of: Subject Category

Enrollee
type: Concept
definition: Subject currently enrolled in a program.
term status: stable
change history: https://credreg.net/qdata/termhistory/subjectCategory/Enrollee/json
in scheme: Subject Category
top concept of: Subject Category

Financial Aid Recipient
type: Concept
definition: Subject currently receiving financial aid while pursuing the credential.
term status: stable
change history: https://credreg.net/qdata/termhistory/subjectCategory/FinancialAidRecipient/json
in scheme: Subject Category
top concept of: Subject Category

Graduate
type: Concept
definition: Subject that has graduated from a program.
term status: stable
change history: https://credreg.net/qdata/termhistory/subjectCategory/Graduate/json
in scheme: Subject Category
top concept of: Subject Category

Higher Level Credential
type: Concept
definition: Subject who has earned a higher level credential.
term status: stable
change history: https://credreg.net/qdata/termhistory/subjectCategory/HigherLevelCredential/json
in scheme: Subject Category
top concept of: Subject Category

In Further Education
type: Concept
definition: Credential holder actively seeking a higher-level credential.
term status: stable
change history: https://credreg.net/qdata/termhistory/subjectCategory/InFurtherEducation/json
in scheme: Subject Category
top concept of: Subject Category

Insufficient Data Available
type: Concept
definition: Subject without sufficiently useful earnings or employment data.
term status: stable
change history: https://credreg.net/qdata/termhistory/subjectCategory/InsufficientDataAvailable/json
in scheme: Subject Category
top concept of: Subject Category

Post-Credential Earnings
type: Concept
definition: Subject with earnings garnered after earning the credential.
term status: stable
change history: https://credreg.net/qdata/termhistory/subjectCategory/PostCredentialEarnings/json
in scheme: Subject Category
top concept of: Subject Category

Pre-Credential Earnings
type: Concept
definition: Subject with earnings garnered prior to earning the credential.
term status: stable
change history: https://credreg.net/qdata/termhistory/subjectCategory/PreCredentialEarnings/json
in scheme: Subject Category
top concept of: Subject Category