Employment Outcome Profile
type: Class
comment: Entity that describes employment outcomes and related statistical information for a given credential.
usage note: The use of ceterms:AggregateDataProfile instead of this class is strongly recommended.
term status: stable
change history: https://credreg.net/qdata/termhistory/ceterms/EmploymentOutcomeProfile/json
subclass of: AggregateDataProfile
subclass of: CreativeWork
domain for: alternateName
domain for: description
domain for: jurisdiction
domain for: name