Subject Category
type: ConceptScheme
comment: Categories of subjects for employment and earnings data.
term status: stable
change history: https://credreg.net/qdata/termhistory/qdata/SubjectCategory/json
has concept: Assessment Completer
has concept: Credential Holder
has concept: Credential Seeker
has concept: Enrollee
has concept: Financial Aid Recipient
has concept: Graduate
has concept: Higher Level Credential
has concept: In Further Education
has concept: Insufficient Data Available
has concept: Post-Credential Earnings
has concept: Pre-Credential Earnings
has top concept: Assessment Completer
has top concept: Credential Holder
has top concept: Credential Seeker
has top concept: Enrollee
has top concept: Financial Aid Recipient
has top concept: Graduate
has top concept: Higher Level Credential
has top concept: In Further Education
has top concept: Insufficient Data Available
has top concept: Post-Credential Earnings
has top concept: Pre-Credential Earnings

Assessment Completer
type: Concept
definition: Subject that has successfully completed an assessment.
term status: stable
change history: https://credreg.net/qdata/termhistory/subjectCategory/AssessmentCompleter/json
in scheme: Subject Category
top concept of: Subject Category

Credential Holder
type: Concept
definition: Subject that has earned the credential during the chosen employment and earnings time period.
term status: stable
change history: https://credreg.net/qdata/termhistory/subjectCategory/CredentialHolder/json
in scheme: Subject Category
top concept of: Subject Category

Credential Seeker
type: Concept
definition: Subject actively seeking the credential through enrollment in a program or taking an assessment.
term status: stable
change history: https://credreg.net/qdata/termhistory/subjectCategory/CredentialSeeker/json
in scheme: Subject Category
top concept of: Subject Category

Enrollee
type: Concept
definition: Subject currently enrolled in a program.
term status: stable
change history: https://credreg.net/qdata/termhistory/subjectCategory/Enrollee/json
in scheme: Subject Category
top concept of: Subject Category

Financial Aid Recipient
type: Concept
definition: Subject currently receiving financial aid while pursuing the credential.
term status: stable
change history: https://credreg.net/qdata/termhistory/subjectCategory/FinancialAidRecipient/json
in scheme: Subject Category
top concept of: Subject Category

Graduate
type: Concept
definition: Subject that has graduated from a program.
term status: stable
change history: https://credreg.net/qdata/termhistory/subjectCategory/Graduate/json
in scheme: Subject Category
top concept of: Subject Category

Higher Level Credential
type: Concept
definition: Subject who has earned a higher level credential.
term status: stable
change history: https://credreg.net/qdata/termhistory/subjectCategory/HigherLevelCredential/json
in scheme: Subject Category
top concept of: Subject Category

In Further Education
type: Concept
definition: Credential holder actively seeking a higher-level credential.
term status: stable
change history: https://credreg.net/qdata/termhistory/subjectCategory/InFurtherEducation/json
in scheme: Subject Category
top concept of: Subject Category

Insufficient Data Available
type: Concept
definition: Subject without sufficiently useful earnings or employment data.
term status: stable
change history: https://credreg.net/qdata/termhistory/subjectCategory/InsufficientDataAvailable/json
in scheme: Subject Category
top concept of: Subject Category

Post-Credential Earnings
type: Concept
definition: Subject with earnings garnered after earning the credential.
term status: stable
change history: https://credreg.net/qdata/termhistory/subjectCategory/PostCredentialEarnings/json
in scheme: Subject Category
top concept of: Subject Category

Pre-Credential Earnings
type: Concept
definition: Subject with earnings garnered prior to earning the credential.
term status: stable
change history: https://credreg.net/qdata/termhistory/subjectCategory/PreCredentialEarnings/json
in scheme: Subject Category
top concept of: Subject Category