Adjustment
type: Property
comment: Describes whether and how the Observations have been adjusted for relevant factors.
description: Examples of factors include inflation, participant demographics, economic conditions, etc.
term status: stable
change history: https://credreg.net/qdata/termhistory/qdata/adjustment/json
domain includes: DataProfile
domain includes: Metric
range includes: langString