demographicEmploymentRate
type: Property
comment: Employment rate for a demographic category.
term status: stable
change history: https://credreg.net/qdata/termhistory/qdata/demographicEmploymentRate/json
domain includes: DataProfile
range includes: QuantitativeValue