Earnings Amount
type: Property
comment: Reference to an entity describing aggregate earnings.
term status: stable
change history: https://credreg.net/qdata/termhistory/qdata/earningsAmount/json
domain includes: DataProfile
range includes: MonetaryAmount