Has Dimension
type: Property
comment: A set of resources or concepts to which the metric is applied or which affect the observation of the metric.
description: The metric may be applied to or affected by resources such as credential earned, industry of employment, year of graduation, location etc.
term status: unstable
change history: https://credreg.net/qdata/termhistory/qdata/hasDimension/json
domain includes: DataSetProfile
range includes: Dimension