Income Determination Type
type: Property
comment: Mechanism by which income is determined; i.e., actual or annualized earnings; select from an enumeration of such types.
term status: stable
change history: https://credreg.net/qdata/termhistory/qdata/incomeDeterminationType/json
domain includes: DataProfile
domain includes: Metric
range includes: Concept
target scheme: IncomeDeterminationMethod