Industry Rate
type: Property
comment: Employment rate for an industry category.
term status: stable
change history: https://credreg.net/qdata/termhistory/qdata/industryRate/json
domain includes: DataProfile
range includes: QuantitativeValue