Is Observation Of
type: Property
comment: Indicates the metric used for this Observation.
term status: unstable
change history: https://credreg.net/qdata/termhistory/qdata/isObservationOf/json
domain includes: Observation
range includes: Metric