Max Percentage
type: Property
comment: The upper percentage of some characteristic or property.
usage note: Best practice is to treat the value of this property as a verbatim percentage; for example, a value of 1.5 should be interpreted as 1.5%
term status: unstable
change history: https://credreg.net/qdata/termhistory/qdata/maxPercentage/json
domain includes: CriterionLevel
domain includes: ValueProfile
domain includes: Observation
domain includes: QuantitativeValue
range includes: float