Metric Type
type: Property
comment: Type of phenomenon being measured; select from an existing enumeration of such types.
term status: unstable
change history: https://credreg.net/qdata/termhistory/qdata/metricType/json
domain includes: Metric
range includes: Concept
target scheme: MetricCategory