Regional Earnings Distribution
type: Property
comment: Reference to an entity describing median earnings as well as earnings at various percentiles for holders or subjects in the region.
term status: stable
change history: https://credreg.net/qdata/termhistory/qdata/regionalEarningsDistribution/json
sub property of: earningsDistribution
domain includes: DataProfile
range includes: QuantitativeValue